{"text_format":"1","workbook":"xlsx","n_sheets":12,"sheets":["Contributions calculator","Codes","State pension age","Lump Sum","NRA60","NRA65","NRA66","NRA67","NRA68","ERF","Printable estimate","Guidance notes"],"not_rendered":{"charts":0,"images":1,"macros":1,"external_links":0,"defined_names":13,"comments":1,"pivot_tables":0},"unopened":[],"bounds":{"document_bytes":16777216,"sheet_cells":100000,"rows_first":2000,"rows_last":500,"rows_between":2000,"halvings":0,"cell_chars":16384,"cell_head_chars":4096},"cells_cut":0,"cells_raw":0,"read":"whole","date_system":"1900"}

{"sheet":"Contributions calculator","index":0,"n_rows":34,"n_cols":11,"rows_kept":34,"cut":false,"hidden":false,"merged":[[1,2,1,6],[33,10,33,11],[27,1,27,2],[28,1,28,2],[26,1,26,2],[30,1,30,6]]}
[]
[null,null,"Additional Pension Benefit Cost Calculator"]
[null,null,"Member Details"]
[null,null,"Date of Birth:  ",null,null,null,null,null,{"$f":"IF(I9=\"Election must start before normal pension age\",\"Error\",\"\")","v":""}]
[]
[null,null,"Normal pension age*  ",null,null,null,null,null,null,"SPA"]
[null,null,"Prospective Normal Pension Age",{"$f":"VLOOKUP(D4,'State pension age'!B4:E50,3,TRUE)","v":65},{"$f":"IF(OR(D7=\"\",D7=0),\"\",\"Years\")","v":"Years"},{"$f":"VLOOKUP(D4,'State pension age'!B4:E50,4,TRUE)","v":0},"Months"]
[]
[null,null,"Date of AP election:  ",null,null,null,null,null,{"$f":"IF(OR(D12=\"\"),\"\",IF(D11>=Codes!E8,\"Election must start before normal pension age\",\"\"))","v":""}]
[]
{"$rows_left_out":25}
{"sheet":"Codes","index":1,"n_rows":231,"n_cols":16,"rows_kept":231,"cut":false,"hidden":true,"merged":[[5,4,5,5]]}
[null,"DOB between","Payment","Form of AP","NPA Options","Lump sum table",null,null,"AP Table results"]
[null,{"$f":"TODAY()-365.25*85","v":"1935-09-07T18:00:00"},"Lump Sum","Member only",60,{"$f":"IF('Contributions calculator'!J6=60,\"S60\",IF('Contributions calculator'!J6=65,\"S65\",IF('Contributions calculator'!J6=\"SPA\",\"S\",\"\")))","v":"S"},null,"S60",null,{"$f":"IF('Contributions calculator'!D23=Codes!D2,VLOOKUP('Contributions calculator'!D11,'Lump Sum'!B9:D60,2,FALSE),IF('Contributions calculator'!D23=Codes!D3,VLOOKUP('Contributions calculator'!D11,'Lump Sum'!B9:D60,3,FALSE),\"\"))","v":{"$error":"#N/A"}}]
[null,{"$f":"TODAY()-365.25*16","v":"2004-09-07"},{"$f":"IF(OR('Contributions calculator'!D12=0,'Contributions calculator'!D12=1),\"\",\"Regular contributions\")","v":"Regular contributions"},"Member and dependant",65,null,null,"S65",null,{"$f":"IF('Contributions calculator'!D23=Codes!D2,VLOOKUP('Contributions calculator'!D11,'Lump Sum'!F9:H60,2,FALSE),IF('Contributions calculator'!D23=Codes!D3,VLOOKUP('Contributions calculator'!D11,'Lump Sum'!F9:H60,3,FALSE),\"\"))","v":{"$error":"#N/A"}}]
[null,null,null,null,"State Pension Age",null,null,"S","Lump sum",{"$f":"IF('Contributions calculator'!D23=Codes!D2,VLOOKUP('Contributions calculator'!D11,'Lump Sum'!J9:L60,2,FALSE),IF('Contributions calculator'!D23=Codes!D3,VLOOKUP('Contributions calculator'!D11,'Lump Sum'!J9:L60,3,FALSE),\"\"))","v":{"$error":"#N/A"}}]
[null,null,null,null,null,null,null,"P60","Regular conts for personal AP of £250 with PNPA 60",{"$f":"INDEX('NRA60'!$W$6:$AQ$58,MATCH('Contributions calculator'!$D$11,'NRA60'!$W$6:$W$58,0),MATCH('Contributions calculator'!$D$21,'NRA60'!$W$6:$AQ$6,0))","v":{"$error":"#N/A"}}]
[null,"Yes/No","Years (N)","Buy out months","Chosen NPA",null,null,"P65","Regular conts for personal AP of £250 with PNPA 65",{"$f":"INDEX('NRA65'!$W$6:$AQ$58,MATCH('Contributions calculator'!$D$11,'NRA65'!$W$6:$W$58,0),MATCH('Contributions calculator'!$D$21,'NRA65'!$W$6:$AQ$6,0))","v":{"$error":"#N/A"}}]
[null,"Yes",0,0,"Years","Months",null,"P66","Regular conts for personal AP of £250 with PNPA 66",{"$f":"INDEX('NRA66'!$W$6:$AQ$58,MATCH('Contributions calculator'!$D$11,'NRA66'!$W$6:$W$58,0),MATCH('Contributions calculator'!$D$21,'NRA66'!$W$6:$AQ$6,0))","v":{"$error":"#N/A"}}]
[null,"No",{"$f":"IF(OR('Contributions calculator'!D7=66,'Contributions calculator'!D7=67,'Contributions calculator'!D7=68),1,\"\")","v":""},{"$f":"'Contributions calculator'!F7","v":0},{"$f":"IF('Contributions calculator'!J6=60,60,IF('Contributions calculator'!J6=65,65,IF(OR('Contributions calculator'!J6=\"SPA\",'Contributions calculator'!J6=\"\"),'Contributions calculator'!D7,\"\")))","v":65},{"$f":"IF('Contributions calculator'!J6=60,0,IF('Contributions calculator'!J6=65,0,IF('Contributions calculator'!J6=\"SPA\",'Contributions calculator'!F7,\"\")))","v":0},null,"P67","Regular conts for personal AP of £250 with PNPA 67",{"$f":"INDEX('NRA67'!$W$6:$AQ$58,MATCH('Contributions calculator'!$D$11,'NRA67'!$W$6:$W$58,0),MATCH('Contributions calculator'!$D$21,'NRA67'!$W$6:$AQ$6,0))","v":{"$error":"#N/A"}}]
[null,null,{"$f":"IF(OR('Contributions calculator'!D7=67,'Contributions calculator'!D7=68),2,\"\")","v":""},null,null,null,null,"P68","Regular conts for personal AP of £250 with PNPA 68",{"$f":"INDEX('NRA68'!$W$6:$AQ$58,MATCH('Contributions calculator'!$D$11,'NRA68'!$W$6:$W$58,0),MATCH('Contributions calculator'!$D$21,'NRA68'!$W$6:$AQ$6,0))","v":{"$error":"#N/A"}}]
[null,null,{"$f":"IF(OR('Contributions calculator'!D7=68),3,\"\")","v":""},null,null,null,null,"D60","Regular conts for personal AP of £250 with PNPA 60 + dependants AP",{"$f":"INDEX('NRA60'!$A$6:$U$58,MATCH('Contributions calculator'!$D$11,'NRA60'!$A$6:$A$58,0),MATCH('Contributions calculator'!$D$21,'NRA60'!$A$6:$U$6,0))","v":{"$error":"#N/A"}}]
{"$rows_left_out":222}
{"sheet":"State pension age","index":2,"n_rows":42,"n_cols":13,"rows_kept":42,"cut":false,"hidden":true,"merged":[]}
[]
[null,null,null,"SPA"]
[null,"Date of birth","Months","Years","Months","Months","Days"]
[null,{"$f":"IF('Contributions calculator'!$D$4<H5,'Contributions calculator'!$D$4,\"\")","v":"00:00:00"},null,65]
["Increase from 65 to 66",{"$f":"IF(AND('Contributions calculator'!$D$4>=H5,'Contributions calculator'!$D$4<=J5),'Contributions calculator'!$D$4,\"\")","v":""},{"$f":"IF(B5=\"\",\"\",IF(DAY(K5)>=DAY(B5),0,-1)+(YEAR(K5)-YEAR(B5))*12+MONTH(K5)-MONTH(B5))","v":""},{"$f":"IF(B5=\"\",\"\",ROUNDDOWN(C5/12,0))","v":""},{"$f":"IF(OR(G5=\"\",G5=0),F5,F5+1)","v":""},{"$f":"IF(B5=\"\",\"\",C5-(D5*12))","v":""},{"$f":"IF(B5=\"\",\"\",K5-M5)","v":""},"1953-12-06",null,"1954-01-05","2019-03-06",null,{"$f":"IF(B5=\"\",\"\",DATE(YEAR(B5)+D5,MONTH(B5)+F5,DAY(B5)))","v":""}]
[null,{"$f":"IF(AND('Contributions calculator'!$D$4>=H6,'Contributions calculator'!$D$4<=J6),'Contributions calculator'!$D$4,\"\")","v":""},"",{"$f":"IF(B6=\"\",\"\",ROUNDDOWN(C6/12,0))","v":""},{"$f":"IF(OR(G6=\"\",G6=0),F6,F6+1)","v":""},{"$f":"IF(B6=\"\",\"\",C6-(D6*12))","v":""},{"$f":"IF(B6=\"\",\"\",K6-M6)","v":""},"1954-01-06",null,"1954-02-05","2019-05-06",null,{"$f":"IF(B6=\"\",\"\",DATE(YEAR(B6)+D6,MONTH(B6)+F6,DAY(B6)))","v":""}]
[null,{"$f":"IF(AND('Contributions calculator'!$D$4>=H7,'Contributions calculator'!$D$4<=J7),'Contributions calculator'!$D$4,\"\")","v":""},"","","","","","1954-02-06",null,"1954-03-05","2019-07-06",null,""]
[null,{"$f":"IF(AND('Contributions calculator'!$D$4>=H8,'Contributions calculator'!$D$4<=J8),'Contributions calculator'!$D$4,\"\")","v":""},"","","","","","1954-03-06",null,"1954-04-05","2019-09-06",null,""]
[null,{"$f":"IF(AND('Contributions calculator'!$D$4>=H9,'Contributions calculator'!$D$4<=J9),'Contributions calculator'!$D$4,\"\")","v":""},"","","","","","1954-04-06",null,"1954-05-05","2019-11-06",null,""]
[null,{"$f":"IF(AND('Contributions calculator'!$D$4>=H10,'Contributions calculator'!$D$4<=J10),'Contributions calculator'!$D$4,\"\")","v":""},"","","","","","1954-05-06",null,"1954-06-05","2020-01-06",null,""]
{"$rows_left_out":33}
{"sheet":"Lump Sum","index":3,"n_rows":58,"n_cols":12,"rows_kept":58,"cut":false,"hidden":true,"merged":[[7,10,7,11],[7,2,7,3],[7,6,7,7]]}
[null,null,null,null,null,null,"Lump Sum Elections"]
[]
[]
[null,"NPA 60",null,null,null,"NPA 65",null,null,null,"2015 Scheme"]
[null,"Table S60 -NPA 60 ",null,null,null,"Table SPA 65 - NPA 65",null,null,null,"Table S"]
[]
[null,"Benefits","Personal","Personal and dependant's",null,"Benefits","Personal","Personal and dependant's",null,"Benefits","Personal","Personal and dependant's"]
[null,"Age when notice of election given","Single premium to purchase £250 of APB at date of election, £",null,null,"Age when notice of election given","Single premium to purchase £250 of APB at date of election, £",null,null,"Age when notice of election given","Single premium to purchase £250 of APB at date of election, £"]
[null,16,2080,2180,null,16,1700,1810,null,16,1510,1630]
[null,17,2120,2230,null,17,1740,1850,null,17,1550,1660]
{"$rows_left_out":49}
{"sheet":"NRA60","index":4,"n_rows":49,"n_cols":43,"rows_kept":49,"cut":false,"hidden":true,"merged":[[4,1,4,20],[4,23,4,42]]}
[]
["Regular Contribution Elections made after 31 March 2011",null,null,null,null,null,null,null,null,null,null,null,null,null,null,null,null,null,null,null,null,null,"Regular Contribution Elections made after 31 March 2011"]
["Table D60: Personal and Dependant's Benefits, NRA 60",null,null,null,null,null,null,null,null,null,null,null,null,null,null,null,null,null,null,null,null,null,"Table P60: Personal Benefits, NRA 60 "]
[]
["Age when notice of election given\nâ","Monthly contribution to purchase £250 of APB at date of election, £",null,null,null,null,null,null,null,null,null,null,null,null,null,null,null,null,null,null,null,null,"Age when notice of election given\nâ","Monthly contribution to purchase £250 of APB at date of election, £"]
["Payment period (in years) à",1,2,3,4,5,6,7,8,9,10,11,12,13,14,15,16,17,18,19,20,null,"Payment period (in years) à",1,2,3,4,5,6,7,8,9,10,11,12,13,14,15,16,17,18,19,20]
[16,297.60000000000002,152.1,103.6,79.400000000000006,64.900000000000006,55.2,48.3,43.2,39.200000000000003,36,33.4,31.2,29.4,27.8,26.5,25.3,24.3,23.4,22.6,21.9,null,16,284.2,145.19999999999999,98.9,75.8,61.9,52.7,46.1,41.2,37.4,34.299999999999997,31.9,29.8,28.1,26.6,25.3,24.2,23.2,22.4,21.6,20.9]
[17,301.10000000000002,153.80000000000001,104.8,80.3,65.599999999999994,55.8,48.9,43.7,39.6,36.4,33.799999999999997,31.6,29.7,28.2,26.8,25.6,24.6,23.7,22.9,22.2,null,17,287.2,146.69999999999999,100,76.599999999999994,62.6,53.3,46.6,41.7,37.799999999999997,34.700000000000003,32.200000000000003,30.1,28.4,26.9,25.6,24.5,23.5,22.6,21.8,21.1]
[18,304.7,155.69999999999999,106.1,81.3,66.400000000000006,56.5,49.5,44.2,40.1,36.799999999999997,34.200000000000003,32,30.1,28.5,27.1,26,24.9,24,23.2,22.4,null,18,290.3,148.30000000000001,101,77.400000000000006,63.3,53.8,47.1,42.1,38.200000000000003,35.1,32.6,30.5,28.7,27.2,25.9,24.7,23.7,22.8,22.1,21.4]
[19,308.2,157.5,107.3,82.2,67.2,57.2,50,44.7,40.6,37.299999999999997,34.6,32.299999999999997,30.5,28.9,27.5,26.3,25.2,24.3,23.4,22.7,null,19,293.3,149.9,102.1,78.2,63.9,54.4,47.6,42.6,38.6,35.5,32.9,30.8,29,27.5,26.1,25,24,23.1,22.3,21.6]
{"$rows_left_out":40}
{"sheet":"NRA65","index":5,"n_rows":55,"n_cols":43,"rows_kept":55,"cut":false,"hidden":true,"merged":[[4,1,4,20],[4,23,4,42]]}
[]
["Regular Contribution Elections",null,null,null,null,null,null,null,null,null,null,null,null,null,null,null,null,null,null,null,null,null,"Regular Contribution Elections"]
["Table D65: Personal and Dependant’s Benefits, NRA 65",null,null,null,null,null,null,null,null,null,null,null,null,null,null,null,null,null,null,null,null,null,"Table P65: Personal Benefits, NRA 65 "]
[]
["Age when notice of election given\nâ","Monthly contribution to purchase £250 of APB at date of election, £",null,null,null,null,null,null,null,null,null,null,null,null,null,null,null,null,null,null,null,null,"Age when notice of election given\nâ","Monthly contribution to purchase £250 of APB at date of election, £"]
["Payment period (in years) à",1,2,3,4,5,6,7,8,9,10,11,12,13,14,15,16,17,18,19,20,null,"Payment period (in years) à",1,2,3,4,5,6,7,8,9,10,11,12,13,14,15,16,17,18,19,20]
[16,154.4,78.900000000000006,53.7,41.2,33.700000000000003,28.6,25.1,22.4,20.3,18.7,17.3,16.2,15.3,14.4,13.8,13.1,12.6,12.1,11.7,11.4,null,16,145.19999999999999,74.2,50.5,38.700000000000003,31.6,26.9,23.6,21.1,19.100000000000001,17.5,16.3,15.2,14.3,13.6,12.9,12.4,11.9,11.4,11,10.7]
[17,157.9,80.7,55,42.1,34.4,29.3,25.6,22.9,20.8,19.100000000000001,17.7,16.600000000000001,15.6,14.8,14.1,13.4,12.9,12.4,12,11.6,null,17,148.30000000000001,75.8,51.6,39.6,32.299999999999997,27.5,24.1,21.5,19.5,17.899999999999999,16.600000000000001,15.6,14.7,13.9,13.2,12.6,12.1,11.7,11.3,10.9]
[18,161.5,82.5,56.2,43.1,35.200000000000003,30,26.2,23.4,21.3,19.5,18.100000000000001,16.899999999999999,16,15.1,14.4,13.8,13.2,12.7,12.3,11.9,null,18,151.5,77.400000000000006,52.7,40.4,33,28.1,24.6,22,19.899999999999999,18.3,17,15.9,15,14.2,13.5,12.9,12.4,11.9,11.5,11.1]
[19,165.2,84.4,57.5,44.1,36,30.6,26.8,24,21.7,20,18.5,17.3,16.3,15.5,14.7,14.1,13.5,13,12.6,12.2,null,19,154.69999999999999,79.099999999999994,53.9,41.3,33.700000000000003,28.7,25.1,22.4,20.399999999999999,18.7,17.399999999999999,16.2,15.3,14.5,13.8,13.2,12.7,12.2,11.8,11.4]
{"$rows_left_out":46}
{"sheet":"NRA66","index":6,"n_rows":55,"n_cols":43,"rows_kept":55,"cut":false,"hidden":true,"merged":[[4,1,4,20],[4,23,4,42]]}
[]
["Regular Contribution Elections",null,null,null,null,null,null,null,null,null,null,null,null,null,null,null,null,null,null,null,null,null,"Regular Contribution Elections"]
["Table D66: Personal and Dependant’s Benefits, NRA 66",null,null,null,null,null,null,null,null,null,null,null,null,null,null,null,null,null,null,null,null,null,"Table P66: Personal Benefits, NRA 66 "]
[]
["Age when notice of election given\nâ","Monthly contribution to purchase £250 of APB at date of election, £",null,null,null,null,null,null,null,null,null,null,null,null,null,null,null,null,null,null,null,null,"Age when notice of election given\nâ","Monthly contribution to purchase £250 of APB at date of election, £"]
["Payment period (in years) à",1,2,3,4,5,6,7,8,9,10,11,12,13,14,15,16,17,18,19,20,null,"Payment period (in years) à",1,2,3,4,5,6,7,8,9,10,11,12,13,14,15,16,17,18,19,20]
[16,148.9,76.099999999999994,51.8,39.700000000000003,32.4,27.6,24.2,21.6,19.600000000000001,18,16.7,15.6,14.7,13.9,13.3,12.7,12.2,11.7,11.3,10.9,null,16,139.5,71.3,48.6,37.200000000000003,30.4,25.9,22.6,20.2,18.399999999999999,16.899999999999999,15.6,14.6,13.8,13.1,12.4,11.9,11.4,11,10.6,10.3]
[17,152.19999999999999,77.8,53,40.6,33.200000000000003,28.2,24.7,22.1,20,18.399999999999999,17.100000000000001,16,15,14.2,13.6,13,12.4,12,11.6,11.2,null,17,142.5,72.8,49.6,38,31.1,26.4,23.1,20.7,18.8,17.2,16,15,14.1,13.3,12.7,12.1,11.6,11.2,10.8,10.5]
[18,155.69999999999999,79.599999999999994,54.2,41.5,33.9,28.9,25.3,22.6,20.5,18.8,17.5,16.3,15.4,14.6,13.9,13.3,12.7,12.3,11.8,11.5,null,18,145.6,74.400000000000006,50.7,38.799999999999997,31.7,27,23.6,21.1,19.2,17.600000000000001,16.3,15.3,14.4,13.6,13,12.4,11.9,11.5,11.1,10.7]
[19,159.19999999999999,81.400000000000006,55.4,42.5,34.700000000000003,29.5,25.9,23.1,21,19.3,17.899999999999999,16.7,15.7,14.9,14.2,13.6,13,12.5,12.1,11.7,null,19,148.69999999999999,76,51.8,39.700000000000003,32.4,27.6,24.1,21.6,19.600000000000001,18,16.7,15.6,14.7,13.9,13.3,12.7,12.2,11.7,11.3,10.9]
{"$rows_left_out":46}
{"sheet":"NRA67","index":7,"n_rows":56,"n_cols":43,"rows_kept":56,"cut":false,"hidden":true,"merged":[[4,1,4,20],[4,23,4,42]]}
[]
["Regular Contribution Elections",null,null,null,null,null,null,null,null,null,null,null,null,null,null,null,null,null,null,null,null,null,"Regular Contribution Elections"]
["Table D67: Personal and Dependant’s Benefits, NRA 67",null,null,null,null,null,null,null,null,null,null,null,null,null,null,null,null,null,null,null,null,null,"Table P67: Personal Benefits, NRA 67 "]
[]
["Age when notice of election given\nâ","Monthly contribution to purchase £250 of APB at date of election, £",null,null,null,null,null,null,null,null,null,null,null,null,null,null,null,null,null,null,null,null,"Age when notice of election given\nâ","Monthly contribution to purchase £250 of APB at date of election, £"]
["Payment period (in years) à",1,2,3,4,5,6,7,8,9,10,11,12,13,14,15,16,17,18,19,20,null,"Payment period (in years) à",1,2,3,4,5,6,7,8,9,10,11,12,13,14,15,16,17,18,19,20]
[16,143.5,73.3,50,38.299999999999997,31.3,26.6,23.3,20.8,18.899999999999999,17.3,16.100000000000001,15.1,14.2,13.4,12.8,12.2,11.7,11.3,10.9,10.6,null,16,134.1,68.5,46.7,35.799999999999997,29.2,24.9,21.8,19.399999999999999,17.600000000000001,16.2,15,14.1,13.2,12.5,11.9,11.4,11,10.6,10.199999999999999,9.9]
[17,146.69999999999999,75,51.1,39.1,32,27.2,23.8,21.3,19.3,17.7,16.5,15.4,14.5,13.7,13.1,12.5,12,11.5,11.1,10.8,null,17,137,70,47.7,36.5,29.9,25.4,22.2,19.899999999999999,18,16.600000000000001,15.4,14.4,13.5,12.8,12.2,11.7,11.2,10.8,10.4,10.1]
[18,150.1,76.7,52.3,40,32.700000000000003,27.8,24.4,21.8,19.8,18.2,16.8,15.8,14.8,14.1,13.4,12.8,12.3,11.8,11.4,11,null,18,139.9,71.5,48.7,37.299999999999997,30.5,26,22.7,20.3,18.399999999999999,16.899999999999999,15.7,14.7,13.8,13.1,12.5,11.9,11.4,11,10.6,10.3]
[19,153.5,78.400000000000006,53.4,40.9,33.5,28.5,24.9,22.3,20.2,18.600000000000001,17.2,16.100000000000001,15.2,14.4,13.7,13.1,12.6,12.1,11.7,11.3,null,19,142.9,73,49.7,38.1,31.1,26.5,23.2,20.7,18.8,17.3,16,15,14.1,13.4,12.7,12.2,11.7,11.2,10.9,10.5]
{"$rows_left_out":47}
{"sheet":"NRA68","index":8,"n_rows":57,"n_cols":43,"rows_kept":57,"cut":false,"hidden":true,"merged":[[4,1,4,20],[4,23,4,42]]}
[]
["Regular Contribution Elections",null,null,null,null,null,null,null,null,null,null,null,null,null,null,null,null,null,null,null,null,null,"Regular Contribution Elections"]
["Table D68: Personal and Dependant’s Benefits, NRA 68",null,null,null,null,null,null,null,null,null,null,null,null,null,null,null,null,null,null,null,null,null,"Table P68: Personal Benefits, NRA 68 "]
[]
["Age when notice of election given\nâ","Monthly contribution to purchase £250 of APB at date of election, £",null,null,null,null,null,null,null,null,null,null,null,null,null,null,null,null,null,null,null,null,"Age when notice of election given\nâ","Monthly contribution to purchase £250 of APB at date of election, £"]
["Payment period (in years) à",1,2,3,4,5,6,7,8,9,10,11,12,13,14,15,16,17,18,19,20,null,"Payment period (in years) à",1,2,3,4,5,6,7,8,9,10,11,12,13,14,15,16,17,18,19,20]
[16,138.4,70.7,48.2,36.9,30.2,25.7,22.5,20.100000000000001,18.2,16.7,15.5,14.5,13.7,13,12.3,11.8,11.3,10.9,10.5,10.199999999999999,null,16,128.9,65.900000000000006,44.9,34.4,28.1,23.9,20.9,18.7,17,15.6,14.5,13.5,12.7,12.1,11.5,11,10.5,10.1,9.8000000000000007,9.5]
[17,141.5,72.3,49.2,37.700000000000003,30.8,26.2,23,20.5,18.600000000000001,17.100000000000001,15.9,14.8,14,13.2,12.6,12,11.6,11.1,10.8,10.4,null,17,131.69999999999999,67.3,45.8,35.1,28.7,24.4,21.4,19.100000000000001,17.3,15.9,14.8,13.8,13,12.3,11.7,11.2,10.8,10.4,10,9.6999999999999993]
[18,144.80000000000001,74,50.4,38.6,31.6,26.9,23.5,21,19.100000000000001,17.5,16.2,15.2,14.3,13.6,12.9,12.3,11.8,11.4,11,10.7,null,18,134.5,68.7,46.8,35.9,29.3,24.9,21.8,19.5,17.7,16.3,15.1,14.1,13.3,12.6,12,11.5,11,10.6,10.199999999999999,9.9]
[19,148,75.599999999999994,51.5,39.5,32.299999999999997,27.5,24,21.5,19.5,17.899999999999999,16.600000000000001,15.5,14.6,13.9,13.2,12.6,12.1,11.7,11.3,10.9,null,19,137.30000000000001,70.2,47.8,36.6,29.9,25.5,22.3,19.899999999999999,18.100000000000001,16.600000000000001,15.4,14.4,13.6,12.9,12.2,11.7,11.2,10.8,10.4,10.1]
{"$rows_left_out":48}
{"sheet":"ERF","index":9,"n_rows":25,"n_cols":13,"rows_kept":25,"cut":false,"hidden":true,"merged":[[1,0,1,13],[2,0,2,13],[3,0,3,13],[4,0,4,13],[5,0,5,12]]}
[]
["TABLE ERF1_NHSSS_2015"]
["NHS SUPERANNUATION SCHEME SCOTLAND (2015): ACTUARIAL FACTORS"]
["BENEFITS PAYABLE TO THE MEMBER ON VOLUNTARY EARLY RETIREMENT (WITH ACTUARIAL REDUCTION)"]
["FACTORS APPLICABLE TO MAIN SCHEME PENSION AND ADDITIONAL PENSION"]
["PENSION FACTORS"]
["Time to NPA: Monthsà\nYears â",0,1,2,3,4,5,6,7,8,9,10,11]
[0,1,0.995,0.99099999999999999,0.98599999999999999,0.98199999999999998,0.97699999999999998,0.97299999999999998,0.96799999999999997,0.96399999999999997,0.95899999999999996,0.95499999999999996,0.95]
[1,0.94599999999999995,0.94199999999999995,0.93799999999999994,0.93300000000000005,0.92900000000000005,0.92500000000000004,0.92100000000000004,0.91700000000000004,0.91300000000000003,0.90900000000000003,0.90400000000000003,0.9]
[2,0.89600000000000002,0.89200000000000002,0.88900000000000001,0.88500000000000001,0.88100000000000001,0.877,0.873,0.86899999999999999,0.86599999999999999,0.86199999999999999,0.85799999999999998,0.85399999999999998]
{"$rows_left_out":16}
{"sheet":"Printable estimate","index":10,"n_rows":28,"n_cols":5,"rows_kept":28,"cut":false,"hidden":true,"merged":[[27,1,27,5],[2,1,2,5]]}
[]
[]
[null,"Illustration of additional pension benefit cost"]
[]
[null,"Your details"]
[null,"Date of Birth:",null,{"$f":"IF('Contributions calculator'!D4=\"\",\"\",'Contributions calculator'!D4)","v":""}]
[]
[null,"Normal pension age:",null,{"$f":"IF(Codes!F8>0,Codes!E8&\" years\",Codes!E8)","v":65},{"$f":"IF(AND(Codes!F8>0,Codes!F8<>\"\"),Codes!F8&\" months\",\"\")","v":""}]
[]
[null,"Date of election:",null,{"$f":"IF('Contributions calculator'!D9=\"\",\"\",'Contributions calculator'!D9)","v":""}]
{"$rows_left_out":19}
{"sheet":"Guidance notes","index":11,"n_rows":39,"n_cols":6,"rows_kept":39,"cut":false,"hidden":false,"merged":[]}
[]
[null,"Additional Pension guidance notes"]
[null,"Disclaimer:\nThis calculation is intended for illustration purposes only. This is not a statement of you legal entitlement. While every care has been taken in the preperation of this calculator the HSC Pension Service will accept no responsibility for the accuracy of the ionformation it provides.\n\nPlease refer to pages on the HSC Pension Service website for points of contact and other benefits available."]
[null,"Using the calculator\nYou must be a contributing member of one of the following schemes if you wish to purchase additional pension:\n• The Health and Personal Social Services (Northern Ireland) 1995/2008\n• The Health and Social Care Pension Scheme (Northern Ireland) 2015\n\nAP benefits will be paid with your scheme retirement benefits and will be index linked.\n\nThe cost of purchasing AP depends on your age and the amount of AP you wish to receive.\n\nThere are two ways you can pay for AP. You can pay by having regular deductions taken from your mionthly salary or by paying a one off lump sum.\n\nFor protected scheme members and members still covered by tapered protection the payable age for your election will be the same as your scheme pension age (60 or 65). All other members should use their state pension age to calculate the cost of additional pension.\n\nAdditional pension must be bought in multiples of £250. Therefore the minimum amount available to purchase is £250.\n\nThe maximum for each scheme is:\n\n• The Health and Personal Social Services (Northern Ireland) 1995/2008 £5000\n• The Health and Social Care Pension Scheme (Northern Ireland) 2015  £6500"]
[null,"HSC Pension Service\nWaterside House\n75 Duke Street, Londonderry\nBT47 6FP                 Telephone: 02871 319111"]
[]
[]
[]
[]
[]
{"$rows_left_out":29}