{"text_format":"1","workbook":"xlsx","n_sheets":12,"sheets":["Contributions calculator","Codes","State pension age","Lump Sum","NRA60","NRA65","NRA66","NRA67","NRA68","ERF","Printable estimate","Guidance notes"],"not_rendered":{"charts":0,"images":1,"macros":1,"external_links":0,"defined_names":13,"comments":1,"pivot_tables":0},"unopened":[],"bounds":{"document_bytes":16777216,"sheet_cells":100000,"rows_first":2000,"rows_last":500,"rows_between":2000,"halvings":0,"cell_chars":16384,"cell_head_chars":4096},"cells_cut":0,"cells_raw":0,"read":"whole","date_system":"1900"}

{"sheet":"Contributions calculator","index":0,"n_rows":34,"n_cols":11,"rows_kept":34,"cut":false,"hidden":false,"merged":[[1,2,1,6],[33,10,33,11],[27,1,27,2],[28,1,28,2],[26,1,26,2],[30,1,30,6]]}
[]
[null,null,"Additional Pension Benefit Cost Calculator"]
[null,null,"Member Details"]
[null,null,"Date of Birth:  ",null,null,null,null,null,{"$f":"IF(I9=\"Election must start before normal pension age\",\"Error\",\"\")","v":""}]
[]
[null,null,"Normal pension age*  ",null,null,null,null,null,null,"SPA"]
[null,null,"Prospective Normal Pension Age",{"$f":"VLOOKUP(D4,'State pension age'!B4:E50,3,TRUE)","v":65},{"$f":"IF(OR(D7=\"\",D7=0),\"\",\"Years\")","v":"Years"},{"$f":"VLOOKUP(D4,'State pension age'!B4:E50,4,TRUE)","v":0},"Months"]
[]
[null,null,"Date of AP election:  ",null,null,null,null,null,{"$f":"IF(OR(D12=\"\"),\"\",IF(D11>=Codes!E8,\"Election must start before normal pension age\",\"\"))","v":""}]
[]
[null,null,"Age at start of agreement:  ",{"$f":"IF(OR(D4=\"\",D9=\"\"),\"\",ROUNDDOWN((D9-D4+1)/365.25,0))","v":""},null,null,null,null,{"$f":"IF(D11<16,\"Error\",\"\")","v":""}]
[null,"Future service","Number of full years between age at election and expected NPA/buy-out retirement age",{"$f":"IF(OR(E7=\"\",D11=\"\"),\"\",Codes!E8-D11)","v":""},{"$f":"IF(D7=\"\",\"\",IF(D11=\"\",\"\",\"Years\"))","v":""}]
[]
[null,null,"Additional pension contract details"]
[null,null,"Maximum additional pension:   ",{"$f":"Codes!P14","v":6500}]
[]
[null,null,"How much additional pension do you wish to purchase?  ",6000,null,null,null,null,{"$f":"IF(D17>D15, \"Error\",\"\")","v":""}]
[]
[null,null,"Please select your payment method:  ","Lump Sum",null,null,null,null,{"$f":"IF(D19=Codes!C2,\"\",IF(D12=1,\"Payment can only be made by lump sum\",\"\"))","v":""}]
[]
[null,null,"Regular payments over how many years?  ",13,null,null,null,null,{"$f":"IF(OR(D21=\"\",D12=\"\", D12<2),\"\",IF(D21>(D12-1),\"Error\",\"\"))","v":""}]
[]
[null,null,"Would you like to buy dependants benefits?  ","Member only",null,null,null,null,{"$f":"IF(D12<2,\"\",IF(I21=\"Error\",\"Payments can be made over a maximum of \"&D12-1&\" years\",\"\"))","v":""}]
[]
[]
[null,null,"Results"]
[null,{"$f":"IF($D$19=Codes!$C$2,\"A lump sum payment of:-\",IF($D$19=Codes!$C$3,\"Monthly payment amount:-\",\"\"))","v":"A lump sum payment of:-"},null,{"$f":"IF(ISERROR(Codes!J18),\"\",IF(OR($D$17=\"\",Codes!J18=\"\",$I$17=\"Error\",$I$11=\"Error\"),\"\",($D$17/250)*Codes!J18))","v":""}]
[null,{"$f":"IF(D19=\"Regular contributions\",\"Annual payment amount:-\",\"\")","v":""},null,{"$f":"IF(OR(D19=\"\",D19=\"Lump sum\",D17=\"\",D21=\"\",D23=\"\"),\"\",IF(D19=\"Regular contributions\",D27*12,\"\"))","v":""}]
[null,{"$f":"IF(D19=\"Regular contributions\",\"Total amount payable over selected period:-\",\"\")","v":""},null,{"$f":"IF(OR(D19=\"\",D19=\"Lump sum\",D21=\"\",D23=\"\",D17=\"\"),\"\",IF(D19=\"Regular contributions\",D28*D21,\"\"))","v":""}]
[]
[null,"Notes:\n\nFor protected scheme members and scheme members still covered by tapered protection the payable age for your election will be the same as your scheme pension age (60 or 65). All  other members should use use their state pension age to calculate the cost of additional pension. \n\nAdditional pension must be bought in multiples of £250. Therefore the minimum amount available to purchase is £250.  \n\nThe maximum amount for each scheme is:\n• The Health and Personal Social Services(Northern Ireland) 1995/2008    £5,000\n• The Health and Social Care Pension Scheme (Northern Ireland) 2015    £6,500",null,null,null,null,null,null,null,null,"*For protected scheme members and scheme members still covered by tapered protection the payable age for your election will be the same as your scheme pension age (60 or 65). All  other members should use their state pension age to calculate the cost of additional pension."]
[]
[]
[null,null,null,null,null,null,null,null,null,null,"V1.0 - Last updated 13/02/2019"]

{"sheet":"Codes","index":1,"n_rows":231,"n_cols":16,"rows_kept":231,"cut":false,"hidden":true,"merged":[[5,4,5,5]]}
[null,"DOB between","Payment","Form of AP","NPA Options","Lump sum table",null,null,"AP Table results"]
[null,{"$f":"TODAY()-365.25*85","v":"1935-09-07T18:00:00"},"Lump Sum","Member only",60,{"$f":"IF('Contributions calculator'!J6=60,\"S60\",IF('Contributions calculator'!J6=65,\"S65\",IF('Contributions calculator'!J6=\"SPA\",\"S\",\"\")))","v":"S"},null,"S60",null,{"$f":"IF('Contributions calculator'!D23=Codes!D2,VLOOKUP('Contributions calculator'!D11,'Lump Sum'!B9:D60,2,FALSE),IF('Contributions calculator'!D23=Codes!D3,VLOOKUP('Contributions calculator'!D11,'Lump Sum'!B9:D60,3,FALSE),\"\"))","v":{"$error":"#N/A"}}]
[null,{"$f":"TODAY()-365.25*16","v":"2004-09-07"},{"$f":"IF(OR('Contributions calculator'!D12=0,'Contributions calculator'!D12=1),\"\",\"Regular contributions\")","v":"Regular contributions"},"Member and dependant",65,null,null,"S65",null,{"$f":"IF('Contributions calculator'!D23=Codes!D2,VLOOKUP('Contributions calculator'!D11,'Lump Sum'!F9:H60,2,FALSE),IF('Contributions calculator'!D23=Codes!D3,VLOOKUP('Contributions calculator'!D11,'Lump Sum'!F9:H60,3,FALSE),\"\"))","v":{"$error":"#N/A"}}]
[null,null,null,null,"State Pension Age",null,null,"S","Lump sum",{"$f":"IF('Contributions calculator'!D23=Codes!D2,VLOOKUP('Contributions calculator'!D11,'Lump Sum'!J9:L60,2,FALSE),IF('Contributions calculator'!D23=Codes!D3,VLOOKUP('Contributions calculator'!D11,'Lump Sum'!J9:L60,3,FALSE),\"\"))","v":{"$error":"#N/A"}}]
[null,null,null,null,null,null,null,"P60","Regular conts for personal AP of £250 with PNPA 60",{"$f":"INDEX('NRA60'!$W$6:$AQ$58,MATCH('Contributions calculator'!$D$11,'NRA60'!$W$6:$W$58,0),MATCH('Contributions calculator'!$D$21,'NRA60'!$W$6:$AQ$6,0))","v":{"$error":"#N/A"}}]
[null,"Yes/No","Years (N)","Buy out months","Chosen NPA",null,null,"P65","Regular conts for personal AP of £250 with PNPA 65",{"$f":"INDEX('NRA65'!$W$6:$AQ$58,MATCH('Contributions calculator'!$D$11,'NRA65'!$W$6:$W$58,0),MATCH('Contributions calculator'!$D$21,'NRA65'!$W$6:$AQ$6,0))","v":{"$error":"#N/A"}}]
[null,"Yes",0,0,"Years","Months",null,"P66","Regular conts for personal AP of £250 with PNPA 66",{"$f":"INDEX('NRA66'!$W$6:$AQ$58,MATCH('Contributions calculator'!$D$11,'NRA66'!$W$6:$W$58,0),MATCH('Contributions calculator'!$D$21,'NRA66'!$W$6:$AQ$6,0))","v":{"$error":"#N/A"}}]
[null,"No",{"$f":"IF(OR('Contributions calculator'!D7=66,'Contributions calculator'!D7=67,'Contributions calculator'!D7=68),1,\"\")","v":""},{"$f":"'Contributions calculator'!F7","v":0},{"$f":"IF('Contributions calculator'!J6=60,60,IF('Contributions calculator'!J6=65,65,IF(OR('Contributions calculator'!J6=\"SPA\",'Contributions calculator'!J6=\"\"),'Contributions calculator'!D7,\"\")))","v":65},{"$f":"IF('Contributions calculator'!J6=60,0,IF('Contributions calculator'!J6=65,0,IF('Contributions calculator'!J6=\"SPA\",'Contributions calculator'!F7,\"\")))","v":0},null,"P67","Regular conts for personal AP of £250 with PNPA 67",{"$f":"INDEX('NRA67'!$W$6:$AQ$58,MATCH('Contributions calculator'!$D$11,'NRA67'!$W$6:$W$58,0),MATCH('Contributions calculator'!$D$21,'NRA67'!$W$6:$AQ$6,0))","v":{"$error":"#N/A"}}]
[null,null,{"$f":"IF(OR('Contributions calculator'!D7=67,'Contributions calculator'!D7=68),2,\"\")","v":""},null,null,null,null,"P68","Regular conts for personal AP of £250 with PNPA 68",{"$f":"INDEX('NRA68'!$W$6:$AQ$58,MATCH('Contributions calculator'!$D$11,'NRA68'!$W$6:$W$58,0),MATCH('Contributions calculator'!$D$21,'NRA68'!$W$6:$AQ$6,0))","v":{"$error":"#N/A"}}]
[null,null,{"$f":"IF(OR('Contributions calculator'!D7=68),3,\"\")","v":""},null,null,null,null,"D60","Regular conts for personal AP of £250 with PNPA 60 + dependants AP",{"$f":"INDEX('NRA60'!$A$6:$U$58,MATCH('Contributions calculator'!$D$11,'NRA60'!$A$6:$A$58,0),MATCH('Contributions calculator'!$D$21,'NRA60'!$A$6:$U$6,0))","v":{"$error":"#N/A"}}]
[null,null,null,null,null,null,null,"D65","Regular conts for personal AP of £250 with PNPA 65 + dependants AP",{"$f":"INDEX('NRA65'!$A$6:$U$58,MATCH('Contributions calculator'!$D$11,'NRA65'!$A$6:$A$58,0),MATCH('Contributions calculator'!$D$21,'NRA65'!$A$6:$U$6,0))","v":{"$error":"#N/A"}},null,null,"AP Limits"]
[null,"Existing AP","AP Available","Contribution period",null,null,null,"D66","Regular conts for personal AP of £250 with PNPA 66 + dependants AP",{"$f":"INDEX('NRA66'!$A$6:$U$58,MATCH('Contributions calculator'!$D$11,'NRA66'!$A$6:$A$58,0),MATCH('Contributions calculator'!$D$21,'NRA66'!$A$6:$U$6,0))","v":{"$error":"#N/A"}},null,null,"• NHS Superannuation Scheme (Scotland)",null,null,5000]
[null,0,{"$f":"IF('Contributions calculator'!$D$15=\"\",\"\",250)","v":250},1,null,null,null,"D67","Regular conts for personal AP of £250 with PNPA 67 + dependants AP",{"$f":"INDEX('NRA67'!$A$6:$U$58,MATCH('Contributions calculator'!$D$11,'NRA67'!$A$6:$A$58,0),MATCH('Contributions calculator'!$D$21,'NRA67'!$A$6:$U$6,0))","v":{"$error":"#N/A"}},null,null,"• NHS Pension Scheme (Scotland) 2013",null,null,6500]
[null,{"$f":"IF(B13<(Codes!$P$14),Codes!B13+250,\"\")","v":250},{"$f":"IF('Contributions calculator'!$D$15=\"\",\"\",IF(C13<('Contributions calculator'!$D$15-249),Codes!C13+250,\"\"))","v":500},{"$f":"IF(D13=\"\",\"\",IF(Codes!D13+1<'Contributions calculator'!$D$12,Codes!D13+1,\"\"))","v":2},null,null,null,"D68","Regular conts for personal AP of £250 with PNPA 68 + dependants AP",{"$f":"INDEX('NRA68'!$A$6:$U$58,MATCH('Contributions calculator'!$D$11,'NRA68'!$A$6:$A$58,0),MATCH('Contributions calculator'!$D$21,'NRA68'!$A$6:$U$6,0))","v":{"$error":"#N/A"}},null,null,null,null,"Applicable Limit",{"$f":"IF(OR('Contributions calculator'!J6=60,'Contributions calculator'!J6=65),Codes!P12,IF('Contributions calculator'!J6=\"SPA\",Codes!P13,\"\"))","v":6500}]
[null,{"$f":"IF(B14<(Codes!$P$14),Codes!B14+250,\"\")","v":500},{"$f":"IF('Contributions calculator'!$D$15=\"\",\"\",IF(C14<('Contributions calculator'!$D$15-249),Codes!C14+250,\"\"))","v":750},{"$f":"IF(D14=\"\",\"\",IF(Codes!D14+1<'Contributions calculator'!$D$12,Codes!D14+1,\"\"))","v":3}]
[null,{"$f":"IF(B15<(Codes!$P$14),Codes!B15+250,\"\")","v":750},{"$f":"IF('Contributions calculator'!$D$15=\"\",\"\",IF(C15<('Contributions calculator'!$D$15-249),Codes!C15+250,\"\"))","v":1000},{"$f":"IF(D15=\"\",\"\",IF(Codes!D15+1<'Contributions calculator'!$D$12,Codes!D15+1,\"\"))","v":4},null,null,null,null,{"$f":"IF(AND('Contributions calculator'!D19=C3,'Contributions calculator'!F7<>0),\"Relevent tables are \"&H25&\" & \"&H26,\"Relevent table is \"&H25&\"\")","v":"Relevent table is S"}]
[null,{"$f":"IF(B16<(Codes!$P$14),Codes!B16+250,\"\")","v":1000},{"$f":"IF('Contributions calculator'!$D$15=\"\",\"\",IF(C16<('Contributions calculator'!$D$15-249),Codes!C16+250,\"\"))","v":1250},{"$f":"IF(D16=\"\",\"\",IF(Codes!D16+1<'Contributions calculator'!$D$12,Codes!D16+1,\"\"))","v":5}]
[null,{"$f":"IF(B17<(Codes!$P$14),Codes!B17+250,\"\")","v":1250},{"$f":"IF('Contributions calculator'!$D$15=\"\",\"\",IF(C17<('Contributions calculator'!$D$15-249),Codes!C17+250,\"\"))","v":1500},{"$f":"IF(D17=\"\",\"\",IF(Codes!D17+1<'Contributions calculator'!$D$12,Codes!D17+1,\"\"))","v":6},null,null,null,null,"Cost of £250 of AP",{"$f":"IF(H26=\"\",I25,((I26-I25)*I23+I25))","v":{"$error":"#N/A"}}]
[null,{"$f":"IF(B18<(Codes!$P$14),Codes!B18+250,\"\")","v":1500},{"$f":"IF('Contributions calculator'!$D$15=\"\",\"\",IF(C18<('Contributions calculator'!$D$15-249),Codes!C18+250,\"\"))","v":1750},{"$f":"IF(D18=\"\",\"\",IF(Codes!D18+1<'Contributions calculator'!$D$12,Codes!D18+1,\"\"))","v":7}]
[null,{"$f":"IF(B19<(Codes!$P$14),Codes!B19+250,\"\")","v":1750},{"$f":"IF('Contributions calculator'!$D$15=\"\",\"\",IF(C19<('Contributions calculator'!$D$15-249),Codes!C19+250,\"\"))","v":2000},{"$f":"IF(D19=\"\",\"\",IF(Codes!D19+1<'Contributions calculator'!$D$12,Codes!D19+1,\"\"))","v":8},null,null,null,null,"Interpolation for monthly contributions for non-integer NPA"]
[null,{"$f":"IF(B20<(Codes!$P$14),Codes!B20+250,\"\")","v":2000},{"$f":"IF('Contributions calculator'!$D$15=\"\",\"\",IF(C20<('Contributions calculator'!$D$15-249),Codes!C20+250,\"\"))","v":2250},{"$f":"IF(D20=\"\",\"\",IF(Codes!D20+1<'Contributions calculator'!$D$12,Codes!D20+1,\"\"))","v":9}]
[null,{"$f":"IF(B21<(Codes!$P$14),Codes!B21+250,\"\")","v":2250},{"$f":"IF('Contributions calculator'!$D$15=\"\",\"\",IF(C21<('Contributions calculator'!$D$15-249),Codes!C21+250,\"\"))","v":2500},{"$f":"IF(D21=\"\",\"\",IF(Codes!D21+1<'Contributions calculator'!$D$12,Codes!D21+1,\"\"))","v":10},null,null,null,"NPA:",{"$f":"E8&\" Years \"&F8&\" months\"","v":"65 Years 0 months"}]
[null,{"$f":"IF(B22<(Codes!$P$14),Codes!B22+250,\"\")","v":2500},{"$f":"IF('Contributions calculator'!$D$15=\"\",\"\",IF(C22<('Contributions calculator'!$D$15-249),Codes!C22+250,\"\"))","v":2750},{"$f":"IF(D22=\"\",\"\",IF(Codes!D22+1<'Contributions calculator'!$D$12,Codes!D22+1,\"\"))","v":11},null,null,null,"Part years",{"$f":"'Contributions calculator'!F7/12","v":0}]
[null,{"$f":"IF(B23<(Codes!$P$14),Codes!B23+250,\"\")","v":2750},{"$f":"IF('Contributions calculator'!$D$15=\"\",\"\",IF(C23<('Contributions calculator'!$D$15-249),Codes!C23+250,\"\"))","v":3000},{"$f":"IF(D23=\"\",\"\",IF(Codes!D23+1<'Contributions calculator'!$D$12,Codes!D23+1,\"\"))","v":12}]
[null,{"$f":"IF(B24<(Codes!$P$14),Codes!B24+250,\"\")","v":3000},{"$f":"IF('Contributions calculator'!$D$15=\"\",\"\",IF(C24<('Contributions calculator'!$D$15-249),Codes!C24+250,\"\"))","v":3250},{"$f":"IF(D24=\"\",\"\",IF(Codes!D24+1<'Contributions calculator'!$D$12,Codes!D24+1,\"\"))","v":13},null,null,null,{"$f":"IF('Contributions calculator'!D19=Codes!C2,F2,IF('Contributions calculator'!D23=D2,\"P\",IF('Contributions calculator'!D23=D3,\"D\",\"\"))&Codes!E8)","v":"S"},{"$f":"VLOOKUP(H25,H2:J14,3,FALSE)","v":{"$error":"#N/A"}}]
[null,{"$f":"IF(B25<(Codes!$P$14),Codes!B25+250,\"\")","v":3250},{"$f":"IF('Contributions calculator'!$D$15=\"\",\"\",IF(C25<('Contributions calculator'!$D$15-249),Codes!C25+250,\"\"))","v":3500},{"$f":"IF(D25=\"\",\"\",IF(Codes!D25+1<'Contributions calculator'!$D$12,Codes!D25+1,\"\"))","v":14},null,null,null,{"$f":"IF(F8=\"\",\"\",IF(AND('Contributions calculator'!D19=\"Regular contributions\",F8<>0),IF('Contributions calculator'!D23=D2,\"P\",IF('Contributions calculator'!D23=D3,\"D\",\"\"))&E8+1,\"\"))","v":""},{"$f":"VLOOKUP(H26,H4:J14,3,FALSE)","v":{"$error":"#N/A"}}]
[null,{"$f":"IF(B26<(Codes!$P$14),Codes!B26+250,\"\")","v":3500},{"$f":"IF('Contributions calculator'!$D$15=\"\",\"\",IF(C26<('Contributions calculator'!$D$15-249),Codes!C26+250,\"\"))","v":3750},{"$f":"IF(D26=\"\",\"\",IF(Codes!D26+1<'Contributions calculator'!$D$12,Codes!D26+1,\"\"))","v":15}]
[null,{"$f":"IF(B27<(Codes!$P$14),Codes!B27+250,\"\")","v":3750},{"$f":"IF('Contributions calculator'!$D$15=\"\",\"\",IF(C27<('Contributions calculator'!$D$15-249),Codes!C27+250,\"\"))","v":4000},{"$f":"IF(D27=\"\",\"\",IF(Codes!D27+1<'Contributions calculator'!$D$12,Codes!D27+1,\"\"))","v":16},null,null,null,null,{"$f":"\"Interpolation for NPA of \"&I22","v":"Interpolation for NPA of 65 Years 0 months"}]
[null,{"$f":"IF(B28<(Codes!$P$14),Codes!B28+250,\"\")","v":4000},{"$f":"IF('Contributions calculator'!$D$15=\"\",\"\",IF(C28<('Contributions calculator'!$D$15-249),Codes!C28+250,\"\"))","v":4250},{"$f":"IF(D28=\"\",\"\",IF(Codes!D28+1<'Contributions calculator'!$D$12,Codes!D28+1,\"\"))","v":17},null,null,null,"=",{"$f":"\"(\"&H26&\" figure - \"&H25&\" figure) x months/12 + \"&H26&\" figure\"","v":"( figure - S figure) x months/12 +  figure"}]
[null,{"$f":"IF(B29<(Codes!$P$14),Codes!B29+250,\"\")","v":4250},{"$f":"IF('Contributions calculator'!$D$15=\"\",\"\",IF(C29<('Contributions calculator'!$D$15-249),Codes!C29+250,\"\"))","v":4500},{"$f":"IF(D29=\"\",\"\",IF(Codes!D29+1<'Contributions calculator'!$D$12,Codes!D29+1,\"\"))","v":18},null,null,null,"=",{"$f":"\"(\"&I26&\" - \"&I25&\") x \"&I23&\" + \"&I26","v":{"$error":"#N/A"}}]
[null,{"$f":"IF(B30<(Codes!$P$14),Codes!B30+250,\"\")","v":4500},{"$f":"IF('Contributions calculator'!$D$15=\"\",\"\",IF(C30<('Contributions calculator'!$D$15-249),Codes!C30+250,\"\"))","v":4750},{"$f":"IF(D30=\"\",\"\",IF(Codes!D30+1<'Contributions calculator'!$D$12,Codes!D30+1,\"\"))","v":19},null,null,null,"=",{"$f":"J18","v":{"$error":"#N/A"}}]
[null,{"$f":"IF(B31<(Codes!$P$14),Codes!B31+250,\"\")","v":4750},{"$f":"IF('Contributions calculator'!$D$15=\"\",\"\",IF(C31<('Contributions calculator'!$D$15-249),Codes!C31+250,\"\"))","v":5000},{"$f":"IF(D31=\"\",\"\",IF(Codes!D31+1<'Contributions calculator'!$D$12,Codes!D31+1,\"\"))","v":20}]
[null,{"$f":"IF(B32<(Codes!$P$14),Codes!B32+250,\"\")","v":5000},{"$f":"IF('Contributions calculator'!$D$15=\"\",\"\",IF(C32<('Contributions calculator'!$D$15-249),Codes!C32+250,\"\"))","v":5250}]
[null,{"$f":"IF(B33<(Codes!$P$14),Codes!B33+250,\"\")","v":5250},{"$f":"IF('Contributions calculator'!$D$15=\"\",\"\",IF(C33<('Contributions calculator'!$D$15-249),Codes!C33+250,\"\"))","v":5500}]
[null,{"$f":"IF(B34<(Codes!$P$14),Codes!B34+250,\"\")","v":5500},{"$f":"IF('Contributions calculator'!$D$15=\"\",\"\",IF(C34<('Contributions calculator'!$D$15-249),Codes!C34+250,\"\"))","v":5750}]
[null,{"$f":"IF(B35<(Codes!$P$14),Codes!B35+250,\"\")","v":5750},{"$f":"IF('Contributions calculator'!$D$15=\"\",\"\",IF(C35<('Contributions calculator'!$D$15-249),Codes!C35+250,\"\"))","v":6000}]
[null,{"$f":"IF(B36<(Codes!$P$14),Codes!B36+250,\"\")","v":6000},{"$f":"IF('Contributions calculator'!$D$15=\"\",\"\",IF(C36<('Contributions calculator'!$D$15-249),Codes!C36+250,\"\"))","v":6250}]
[null,{"$f":"IF(B37<(Codes!$P$14),Codes!B37+250,\"\")","v":6250},{"$f":"IF('Contributions calculator'!$D$15=\"\",\"\",IF(C37<('Contributions calculator'!$D$15-249),Codes!C37+250,\"\"))","v":6500}]
[null,{"$f":"IF(B38<(Codes!$P$14),Codes!B38+250,\"\")","v":6500},{"$f":"IF('Contributions calculator'!$D$15=\"\",\"\",IF(C38<('Contributions calculator'!$D$15-249),Codes!C38+250,\"\"))","v":""}]
[null,null,{"$f":"IF('Contributions calculator'!$D$13=\"\",\"\",IF(C39<('Contributions calculator'!$D$13-249),Codes!C39+250,\"\"))","v":""}]
[null,null,{"$f":"IF('Contributions calculator'!$D$13=\"\",\"\",IF(C40<('Contributions calculator'!$D$13-249),Codes!C40+250,\"\"))","v":""}]
[null,null,{"$f":"IF('Contributions calculator'!$D$13=\"\",\"\",IF(C41<('Contributions calculator'!$D$13-249),Codes!C41+250,\"\"))","v":""}]
[null,null,{"$f":"IF('Contributions calculator'!$D$13=\"\",\"\",IF(C42<('Contributions calculator'!$D$13-249),Codes!C42+250,\"\"))","v":""}]
[]
[]
[]
[]
[]
[null,{"$f":"IF(B48<('Contributions calculator'!$E$13-250),Codes!B48+250,\"\")","v":""}]
[null,{"$f":"IF(B49<('Contributions calculator'!$E$13-250),Codes!B49+250,\"\")","v":""}]
[null,{"$f":"IF(B50<('Contributions calculator'!$E$13-250),Codes!B50+250,\"\")","v":""}]
[null,{"$f":"IF(B51<('Contributions calculator'!$E$13-250),Codes!B51+250,\"\")","v":""}]
[null,{"$f":"IF(B52<('Contributions calculator'!$E$13-250),Codes!B52+250,\"\")","v":""}]
[null,{"$f":"IF(B53<('Contributions calculator'!$E$13-250),Codes!B53+250,\"\")","v":""}]
[null,{"$f":"IF(B54<('Contributions calculator'!$E$13-250),Codes!B54+250,\"\")","v":""}]
[null,{"$f":"IF(B55<('Contributions calculator'!$E$13-250),Codes!B55+250,\"\")","v":""}]
[null,{"$f":"IF(B56<('Contributions calculator'!$E$13-250),Codes!B56+250,\"\")","v":""}]
[null,{"$f":"IF(B57<('Contributions calculator'!$E$13-250),Codes!B57+250,\"\")","v":""}]
[null,{"$f":"IF(B58<('Contributions calculator'!$E$13-250),Codes!B58+250,\"\")","v":""}]
[null,{"$f":"IF(B59<('Contributions calculator'!$E$13-250),Codes!B59+250,\"\")","v":""}]
[null,{"$f":"IF(B60<('Contributions calculator'!$E$13-250),Codes!B60+250,\"\")","v":""}]
[null,{"$f":"IF(B61<('Contributions calculator'!$E$13-250),Codes!B61+250,\"\")","v":""}]
[null,{"$f":"IF(B62<('Contributions calculator'!$E$13-250),Codes!B62+250,\"\")","v":""}]
[null,{"$f":"IF(B63<('Contributions calculator'!$E$13-250),Codes!B63+250,\"\")","v":""}]
[null,{"$f":"IF(B64<('Contributions calculator'!$E$13-250),Codes!B64+250,\"\")","v":""}]
[null,{"$f":"IF(B65<('Contributions calculator'!$E$13-250),Codes!B65+250,\"\")","v":""}]
[null,{"$f":"IF(B66<('Contributions calculator'!$E$13-250),Codes!B66+250,\"\")","v":""}]
[null,{"$f":"IF(B67<('Contributions calculator'!$E$13-250),Codes!B67+250,\"\")","v":""}]
[null,{"$f":"IF(B68<('Contributions calculator'!$E$13-250),Codes!B68+250,\"\")","v":""}]
[null,{"$f":"IF(B69<('Contributions calculator'!$E$13-250),Codes!B69+250,\"\")","v":""}]
[null,{"$f":"IF(B70<('Contributions calculator'!$E$13-250),Codes!B70+250,\"\")","v":""}]
[null,{"$f":"IF(B71<('Contributions calculator'!$E$13-250),Codes!B71+250,\"\")","v":""}]
[null,{"$f":"IF(B72<('Contributions calculator'!$E$13-250),Codes!B72+250,\"\")","v":""}]
[null,{"$f":"IF(B73<('Contributions calculator'!$E$13-250),Codes!B73+250,\"\")","v":""}]
[null,{"$f":"IF(B74<('Contributions calculator'!$E$13-250),Codes!B74+250,\"\")","v":""}]
[null,{"$f":"IF(B75<('Contributions calculator'!$E$13-250),Codes!B75+250,\"\")","v":""}]
[null,{"$f":"IF(B76<('Contributions calculator'!$E$13-250),Codes!B76+250,\"\")","v":""}]
[null,{"$f":"IF(B77<('Contributions calculator'!$E$13-250),Codes!B77+250,\"\")","v":""}]
[null,{"$f":"IF(B78<('Contributions calculator'!$E$13-250),Codes!B78+250,\"\")","v":""}]
[null,{"$f":"IF(B79<('Contributions calculator'!$E$13-250),Codes!B79+250,\"\")","v":""}]
[null,{"$f":"IF(B80<('Contributions calculator'!$E$13-250),Codes!B80+250,\"\")","v":""}]
[null,{"$f":"IF(B81<('Contributions calculator'!$E$13-250),Codes!B81+250,\"\")","v":""}]
[null,{"$f":"IF(B82<('Contributions calculator'!$E$13-250),Codes!B82+250,\"\")","v":""}]
[null,{"$f":"IF(B83<('Contributions calculator'!$E$13-250),Codes!B83+250,\"\")","v":""}]
[null,{"$f":"IF(B84<('Contributions calculator'!$E$13-250),Codes!B84+250,\"\")","v":""}]
[null,{"$f":"IF(B85<('Contributions calculator'!$E$13-250),Codes!B85+250,\"\")","v":""}]
[null,{"$f":"IF(B86<('Contributions calculator'!$E$13-250),Codes!B86+250,\"\")","v":""}]
[null,{"$f":"IF(B87<('Contributions calculator'!$E$13-250),Codes!B87+250,\"\")","v":""}]
[null,{"$f":"IF(B88<('Contributions calculator'!$E$13-250),Codes!B88+250,\"\")","v":""}]
[null,{"$f":"IF(B89<('Contributions calculator'!$E$13-250),Codes!B89+250,\"\")","v":""}]
[null,{"$f":"IF(B90<('Contributions calculator'!$E$13-250),Codes!B90+250,\"\")","v":""}]
[null,{"$f":"IF(B91<('Contributions calculator'!$E$13-250),Codes!B91+250,\"\")","v":""}]
[null,{"$f":"IF(B92<('Contributions calculator'!$E$13-250),Codes!B92+250,\"\")","v":""}]
[null,{"$f":"IF(B93<('Contributions calculator'!$E$13-250),Codes!B93+250,\"\")","v":""}]
[null,{"$f":"IF(B94<('Contributions calculator'!$E$13-250),Codes!B94+250,\"\")","v":""}]
[null,{"$f":"IF(B95<('Contributions calculator'!$E$13-250),Codes!B95+250,\"\")","v":""}]
[null,{"$f":"IF(B96<('Contributions calculator'!$E$13-250),Codes!B96+250,\"\")","v":""}]
[null,{"$f":"IF(B97<('Contributions calculator'!$E$13-250),Codes!B97+250,\"\")","v":""}]
[null,{"$f":"IF(B98<('Contributions calculator'!$E$13-250),Codes!B98+250,\"\")","v":""}]
[null,{"$f":"IF(B99<('Contributions calculator'!$E$13-250),Codes!B99+250,\"\")","v":""}]
[null,{"$f":"IF(B100<('Contributions calculator'!$E$13-250),Codes!B100+250,\"\")","v":""}]
[null,{"$f":"IF(B101<('Contributions calculator'!$E$13-250),Codes!B101+250,\"\")","v":""}]
[null,{"$f":"IF(B102<('Contributions calculator'!$E$13-250),Codes!B102+250,\"\")","v":""}]
[null,{"$f":"IF(B103<('Contributions calculator'!$E$13-250),Codes!B103+250,\"\")","v":""}]
[null,{"$f":"IF(B104<('Contributions calculator'!$E$13-250),Codes!B104+250,\"\")","v":""}]
[null,{"$f":"IF(B105<('Contributions calculator'!$E$13-250),Codes!B105+250,\"\")","v":""}]
[null,{"$f":"IF(B106<('Contributions calculator'!$E$13-250),Codes!B106+250,\"\")","v":""}]
[null,{"$f":"IF(B107<('Contributions calculator'!$E$13-250),Codes!B107+250,\"\")","v":""}]
[null,{"$f":"IF(B108<('Contributions calculator'!$E$13-250),Codes!B108+250,\"\")","v":""}]
[null,{"$f":"IF(B109<('Contributions calculator'!$E$13-250),Codes!B109+250,\"\")","v":""}]
[null,{"$f":"IF(B110<('Contributions calculator'!$E$13-250),Codes!B110+250,\"\")","v":""}]
[null,{"$f":"IF(B111<('Contributions calculator'!$E$13-250),Codes!B111+250,\"\")","v":""}]
[null,{"$f":"IF(B112<('Contributions calculator'!$E$13-250),Codes!B112+250,\"\")","v":""}]
[null,{"$f":"IF(B113<('Contributions calculator'!$E$13-250),Codes!B113+250,\"\")","v":""}]
[null,{"$f":"IF(B114<('Contributions calculator'!$E$13-250),Codes!B114+250,\"\")","v":""}]
[null,{"$f":"IF(B115<('Contributions calculator'!$E$13-250),Codes!B115+250,\"\")","v":""}]
[null,{"$f":"IF(B116<('Contributions calculator'!$E$13-250),Codes!B116+250,\"\")","v":""}]
[null,{"$f":"IF(B117<('Contributions calculator'!$E$13-250),Codes!B117+250,\"\")","v":""}]
[null,{"$f":"IF(B118<('Contributions calculator'!$E$13-250),Codes!B118+250,\"\")","v":""}]
[null,{"$f":"IF(B119<('Contributions calculator'!$E$13-250),Codes!B119+250,\"\")","v":""}]
[null,{"$f":"IF(B120<('Contributions calculator'!$E$13-250),Codes!B120+250,\"\")","v":""}]
[null,{"$f":"IF(B121<('Contributions calculator'!$E$13-250),Codes!B121+250,\"\")","v":""}]
[null,{"$f":"IF(B122<('Contributions calculator'!$E$13-250),Codes!B122+250,\"\")","v":""}]
[null,{"$f":"IF(B123<('Contributions calculator'!$E$13-250),Codes!B123+250,\"\")","v":""}]
[null,{"$f":"IF(B124<('Contributions calculator'!$E$13-250),Codes!B124+250,\"\")","v":""}]
[null,{"$f":"IF(B125<('Contributions calculator'!$E$13-250),Codes!B125+250,\"\")","v":""}]
[null,{"$f":"IF(B126<('Contributions calculator'!$E$13-250),Codes!B126+250,\"\")","v":""}]
[null,{"$f":"IF(B127<('Contributions calculator'!$E$13-250),Codes!B127+250,\"\")","v":""}]
[null,{"$f":"IF(B128<('Contributions calculator'!$E$13-250),Codes!B128+250,\"\")","v":""}]
[null,{"$f":"IF(B129<('Contributions calculator'!$E$13-250),Codes!B129+250,\"\")","v":""}]
[null,{"$f":"IF(B130<('Contributions calculator'!$E$13-250),Codes!B130+250,\"\")","v":""}]
[null,{"$f":"IF(B131<('Contributions calculator'!$E$13-250),Codes!B131+250,\"\")","v":""}]
[null,{"$f":"IF(B132<('Contributions calculator'!$E$13-250),Codes!B132+250,\"\")","v":""}]
[null,{"$f":"IF(B133<('Contributions calculator'!$E$13-250),Codes!B133+250,\"\")","v":""}]
[null,{"$f":"IF(B134<('Contributions calculator'!$E$13-250),Codes!B134+250,\"\")","v":""}]
[null,{"$f":"IF(B135<('Contributions calculator'!$E$13-250),Codes!B135+250,\"\")","v":""}]
[null,{"$f":"IF(B136<('Contributions calculator'!$E$13-250),Codes!B136+250,\"\")","v":""}]
[null,{"$f":"IF(B137<('Contributions calculator'!$E$13-250),Codes!B137+250,\"\")","v":""}]
[null,{"$f":"IF(B138<('Contributions calculator'!$E$13-250),Codes!B138+250,\"\")","v":""}]
[null,{"$f":"IF(B139<('Contributions calculator'!$E$13-250),Codes!B139+250,\"\")","v":""}]
[null,{"$f":"IF(B140<('Contributions calculator'!$E$13-250),Codes!B140+250,\"\")","v":""}]
[null,{"$f":"IF(B141<('Contributions calculator'!$E$13-250),Codes!B141+250,\"\")","v":""}]
[null,{"$f":"IF(B142<('Contributions calculator'!$E$13-250),Codes!B142+250,\"\")","v":""}]
[null,{"$f":"IF(B143<('Contributions calculator'!$E$13-250),Codes!B143+250,\"\")","v":""}]
[null,{"$f":"IF(B144<('Contributions calculator'!$E$13-250),Codes!B144+250,\"\")","v":""}]
[null,{"$f":"IF(B145<('Contributions calculator'!$E$13-250),Codes!B145+250,\"\")","v":""}]
[null,{"$f":"IF(B146<('Contributions calculator'!$E$13-250),Codes!B146+250,\"\")","v":""}]
[null,{"$f":"IF(B147<('Contributions calculator'!$E$13-250),Codes!B147+250,\"\")","v":""}]
[null,{"$f":"IF(B148<('Contributions calculator'!$E$13-250),Codes!B148+250,\"\")","v":""}]
[null,{"$f":"IF(B149<('Contributions calculator'!$E$13-250),Codes!B149+250,\"\")","v":""}]
[null,{"$f":"IF(B150<('Contributions calculator'!$E$13-250),Codes!B150+250,\"\")","v":""}]
[null,{"$f":"IF(B151<('Contributions calculator'!$E$13-250),Codes!B151+250,\"\")","v":""}]
[null,{"$f":"IF(B152<('Contributions calculator'!$E$13-250),Codes!B152+250,\"\")","v":""}]
[null,{"$f":"IF(B153<('Contributions calculator'!$E$13-250),Codes!B153+250,\"\")","v":""}]
[null,{"$f":"IF(B154<('Contributions calculator'!$E$13-250),Codes!B154+250,\"\")","v":""}]
[null,{"$f":"IF(B155<('Contributions calculator'!$E$13-250),Codes!B155+250,\"\")","v":""}]
[null,{"$f":"IF(B156<('Contributions calculator'!$E$13-250),Codes!B156+250,\"\")","v":""}]
[null,{"$f":"IF(B157<('Contributions calculator'!$E$13-250),Codes!B157+250,\"\")","v":""}]
[null,{"$f":"IF(B158<('Contributions calculator'!$E$13-250),Codes!B158+250,\"\")","v":""}]
[null,{"$f":"IF(B159<('Contributions calculator'!$E$13-250),Codes!B159+250,\"\")","v":""}]
[null,{"$f":"IF(B160<('Contributions calculator'!$E$13-250),Codes!B160+250,\"\")","v":""}]
[null,{"$f":"IF(B161<('Contributions calculator'!$E$13-250),Codes!B161+250,\"\")","v":""}]
[null,{"$f":"IF(B162<('Contributions calculator'!$E$13-250),Codes!B162+250,\"\")","v":""}]
[null,{"$f":"IF(B163<('Contributions calculator'!$E$13-250),Codes!B163+250,\"\")","v":""}]
[null,{"$f":"IF(B164<('Contributions calculator'!$E$13-250),Codes!B164+250,\"\")","v":""}]
[null,{"$f":"IF(B165<('Contributions calculator'!$E$13-250),Codes!B165+250,\"\")","v":""}]
[null,{"$f":"IF(B166<('Contributions calculator'!$E$13-250),Codes!B166+250,\"\")","v":""}]
[null,{"$f":"IF(B167<('Contributions calculator'!$E$13-250),Codes!B167+250,\"\")","v":""}]
[null,{"$f":"IF(B168<('Contributions calculator'!$E$13-250),Codes!B168+250,\"\")","v":""}]
[null,{"$f":"IF(B169<('Contributions calculator'!$E$13-250),Codes!B169+250,\"\")","v":""}]
[null,{"$f":"IF(B170<('Contributions calculator'!$E$13-250),Codes!B170+250,\"\")","v":""}]
[null,{"$f":"IF(B171<('Contributions calculator'!$E$13-250),Codes!B171+250,\"\")","v":""}]
[null,{"$f":"IF(B172<('Contributions calculator'!$E$13-250),Codes!B172+250,\"\")","v":""}]
[null,{"$f":"IF(B173<('Contributions calculator'!$E$13-250),Codes!B173+250,\"\")","v":""}]
[null,{"$f":"IF(B174<('Contributions calculator'!$E$13-250),Codes!B174+250,\"\")","v":""}]
[null,{"$f":"IF(B175<('Contributions calculator'!$E$13-250),Codes!B175+250,\"\")","v":""}]
[null,{"$f":"IF(B176<('Contributions calculator'!$E$13-250),Codes!B176+250,\"\")","v":""}]
[null,{"$f":"IF(B177<('Contributions calculator'!$E$13-250),Codes!B177+250,\"\")","v":""}]
[null,{"$f":"IF(B178<('Contributions calculator'!$E$13-250),Codes!B178+250,\"\")","v":""}]
[null,{"$f":"IF(B179<('Contributions calculator'!$E$13-250),Codes!B179+250,\"\")","v":""}]
[null,{"$f":"IF(B180<('Contributions calculator'!$E$13-250),Codes!B180+250,\"\")","v":""}]
[null,{"$f":"IF(B181<('Contributions calculator'!$E$13-250),Codes!B181+250,\"\")","v":""}]
[null,{"$f":"IF(B182<('Contributions calculator'!$E$13-250),Codes!B182+250,\"\")","v":""}]
[null,{"$f":"IF(B183<('Contributions calculator'!$E$13-250),Codes!B183+250,\"\")","v":""}]
[null,{"$f":"IF(B184<('Contributions calculator'!$E$13-250),Codes!B184+250,\"\")","v":""}]
[null,{"$f":"IF(B185<('Contributions calculator'!$E$13-250),Codes!B185+250,\"\")","v":""}]
[null,{"$f":"IF(B186<('Contributions calculator'!$E$13-250),Codes!B186+250,\"\")","v":""}]
[null,{"$f":"IF(B187<('Contributions calculator'!$E$13-250),Codes!B187+250,\"\")","v":""}]
[null,{"$f":"IF(B188<('Contributions calculator'!$E$13-250),Codes!B188+250,\"\")","v":""}]
[null,{"$f":"IF(B189<('Contributions calculator'!$E$13-250),Codes!B189+250,\"\")","v":""}]
[null,{"$f":"IF(B190<('Contributions calculator'!$E$13-250),Codes!B190+250,\"\")","v":""}]
[null,{"$f":"IF(B191<('Contributions calculator'!$E$13-250),Codes!B191+250,\"\")","v":""}]
[null,{"$f":"IF(B192<('Contributions calculator'!$E$13-250),Codes!B192+250,\"\")","v":""}]
[null,{"$f":"IF(B193<('Contributions calculator'!$E$13-250),Codes!B193+250,\"\")","v":""}]
[null,{"$f":"IF(B194<('Contributions calculator'!$E$13-250),Codes!B194+250,\"\")","v":""}]
[null,{"$f":"IF(B195<('Contributions calculator'!$E$13-250),Codes!B195+250,\"\")","v":""}]
[null,{"$f":"IF(B196<('Contributions calculator'!$E$13-250),Codes!B196+250,\"\")","v":""}]
[null,{"$f":"IF(B197<('Contributions calculator'!$E$13-250),Codes!B197+250,\"\")","v":""}]
[null,{"$f":"IF(B198<('Contributions calculator'!$E$13-250),Codes!B198+250,\"\")","v":""}]
[null,{"$f":"IF(B199<('Contributions calculator'!$E$13-250),Codes!B199+250,\"\")","v":""}]
[null,{"$f":"IF(B200<('Contributions calculator'!$E$13-250),Codes!B200+250,\"\")","v":""}]
[null,{"$f":"IF(B201<('Contributions calculator'!$E$13-250),Codes!B201+250,\"\")","v":""}]
[null,{"$f":"IF(B202<('Contributions calculator'!$E$13-250),Codes!B202+250,\"\")","v":""}]
[null,{"$f":"IF(B203<('Contributions calculator'!$E$13-250),Codes!B203+250,\"\")","v":""}]
[null,{"$f":"IF(B204<('Contributions calculator'!$E$13-250),Codes!B204+250,\"\")","v":""}]
[null,{"$f":"IF(B205<('Contributions calculator'!$E$13-250),Codes!B205+250,\"\")","v":""}]
[null,{"$f":"IF(B206<('Contributions calculator'!$E$13-250),Codes!B206+250,\"\")","v":""}]
[null,{"$f":"IF(B207<('Contributions calculator'!$E$13-250),Codes!B207+250,\"\")","v":""}]
[null,{"$f":"IF(B208<('Contributions calculator'!$E$13-250),Codes!B208+250,\"\")","v":""}]
[null,{"$f":"IF(B209<('Contributions calculator'!$E$13-250),Codes!B209+250,\"\")","v":""}]
[null,{"$f":"IF(B210<('Contributions calculator'!$E$13-250),Codes!B210+250,\"\")","v":""}]
[null,{"$f":"IF(B211<('Contributions calculator'!$E$13-250),Codes!B211+250,\"\")","v":""}]
[null,{"$f":"IF(B212<('Contributions calculator'!$E$13-250),Codes!B212+250,\"\")","v":""}]
[null,{"$f":"IF(B213<('Contributions calculator'!$E$13-250),Codes!B213+250,\"\")","v":""}]
[null,{"$f":"IF(B214<('Contributions calculator'!$E$13-250),Codes!B214+250,\"\")","v":""}]
[null,{"$f":"IF(B215<('Contributions calculator'!$E$13-250),Codes!B215+250,\"\")","v":""}]
[null,{"$f":"IF(B216<('Contributions calculator'!$E$13-250),Codes!B216+250,\"\")","v":""}]
[null,{"$f":"IF(B217<('Contributions calculator'!$E$13-250),Codes!B217+250,\"\")","v":""}]
[null,{"$f":"IF(B218<('Contributions calculator'!$E$13-250),Codes!B218+250,\"\")","v":""}]
[null,{"$f":"IF(B219<('Contributions calculator'!$E$13-250),Codes!B219+250,\"\")","v":""}]
[null,{"$f":"IF(B220<('Contributions calculator'!$E$13-250),Codes!B220+250,\"\")","v":""}]
[null,{"$f":"IF(B221<('Contributions calculator'!$E$13-250),Codes!B221+250,\"\")","v":""}]
[null,{"$f":"IF(B222<('Contributions calculator'!$E$13-250),Codes!B222+250,\"\")","v":""}]
[null,{"$f":"IF(B223<('Contributions calculator'!$E$13-250),Codes!B223+250,\"\")","v":""}]
[null,{"$f":"IF(B224<('Contributions calculator'!$E$13-250),Codes!B224+250,\"\")","v":""}]
[null,{"$f":"IF(B225<('Contributions calculator'!$E$13-250),Codes!B225+250,\"\")","v":""}]
[null,{"$f":"IF(B226<('Contributions calculator'!$E$13-250),Codes!B226+250,\"\")","v":""}]
[null,{"$f":"IF(B227<('Contributions calculator'!$E$13-250),Codes!B227+250,\"\")","v":""}]
[null,{"$f":"IF(B228<('Contributions calculator'!$E$13-250),Codes!B228+250,\"\")","v":""}]
[null,{"$f":"IF(B229<('Contributions calculator'!$E$13-250),Codes!B229+250,\"\")","v":""}]
[null,{"$f":"IF(B230<('Contributions calculator'!$E$13-250),Codes!B230+250,\"\")","v":""}]

{"sheet":"State pension age","index":2,"n_rows":42,"n_cols":13,"rows_kept":42,"cut":false,"hidden":true,"merged":[]}
[]
[null,null,null,"SPA"]
[null,"Date of birth","Months","Years","Months","Months","Days"]
[null,{"$f":"IF('Contributions calculator'!$D$4<H5,'Contributions calculator'!$D$4,\"\")","v":"00:00:00"},null,65]
["Increase from 65 to 66",{"$f":"IF(AND('Contributions calculator'!$D$4>=H5,'Contributions calculator'!$D$4<=J5),'Contributions calculator'!$D$4,\"\")","v":""},{"$f":"IF(B5=\"\",\"\",IF(DAY(K5)>=DAY(B5),0,-1)+(YEAR(K5)-YEAR(B5))*12+MONTH(K5)-MONTH(B5))","v":""},{"$f":"IF(B5=\"\",\"\",ROUNDDOWN(C5/12,0))","v":""},{"$f":"IF(OR(G5=\"\",G5=0),F5,F5+1)","v":""},{"$f":"IF(B5=\"\",\"\",C5-(D5*12))","v":""},{"$f":"IF(B5=\"\",\"\",K5-M5)","v":""},"1953-12-06",null,"1954-01-05","2019-03-06",null,{"$f":"IF(B5=\"\",\"\",DATE(YEAR(B5)+D5,MONTH(B5)+F5,DAY(B5)))","v":""}]
[null,{"$f":"IF(AND('Contributions calculator'!$D$4>=H6,'Contributions calculator'!$D$4<=J6),'Contributions calculator'!$D$4,\"\")","v":""},"",{"$f":"IF(B6=\"\",\"\",ROUNDDOWN(C6/12,0))","v":""},{"$f":"IF(OR(G6=\"\",G6=0),F6,F6+1)","v":""},{"$f":"IF(B6=\"\",\"\",C6-(D6*12))","v":""},{"$f":"IF(B6=\"\",\"\",K6-M6)","v":""},"1954-01-06",null,"1954-02-05","2019-05-06",null,{"$f":"IF(B6=\"\",\"\",DATE(YEAR(B6)+D6,MONTH(B6)+F6,DAY(B6)))","v":""}]
[null,{"$f":"IF(AND('Contributions calculator'!$D$4>=H7,'Contributions calculator'!$D$4<=J7),'Contributions calculator'!$D$4,\"\")","v":""},"","","","","","1954-02-06",null,"1954-03-05","2019-07-06",null,""]
[null,{"$f":"IF(AND('Contributions calculator'!$D$4>=H8,'Contributions calculator'!$D$4<=J8),'Contributions calculator'!$D$4,\"\")","v":""},"","","","","","1954-03-06",null,"1954-04-05","2019-09-06",null,""]
[null,{"$f":"IF(AND('Contributions calculator'!$D$4>=H9,'Contributions calculator'!$D$4<=J9),'Contributions calculator'!$D$4,\"\")","v":""},"","","","","","1954-04-06",null,"1954-05-05","2019-11-06",null,""]
[null,{"$f":"IF(AND('Contributions calculator'!$D$4>=H10,'Contributions calculator'!$D$4<=J10),'Contributions calculator'!$D$4,\"\")","v":""},"","","","","","1954-05-06",null,"1954-06-05","2020-01-06",null,""]
[null,{"$f":"IF(AND('Contributions calculator'!$D$4>=H11,'Contributions calculator'!$D$4<=J11),'Contributions calculator'!$D$4,\"\")","v":""},"","","","","","1954-06-06",null,"1954-07-05","2020-03-06",null,""]
[null,{"$f":"IF(AND('Contributions calculator'!$D$4>=H12,'Contributions calculator'!$D$4<=J12),'Contributions calculator'!$D$4,\"\")","v":""},"","","","","","1954-07-06",null,"1954-08-05","2020-05-06",null,""]
[null,{"$f":"IF(AND('Contributions calculator'!$D$4>=H13,'Contributions calculator'!$D$4<=J13),'Contributions calculator'!$D$4,\"\")","v":""},"","","","","","1954-08-06",null,"1954-09-05","2020-07-06",null,""]
[null,{"$f":"IF(AND('Contributions calculator'!$D$4>=H14,'Contributions calculator'!$D$4<=J14),'Contributions calculator'!$D$4,\"\")","v":""},"","","","","","1954-09-06",null,"1954-10-05","2020-09-06",null,""]
[null,{"$f":"IF(AND('Contributions calculator'!$D$4>=H15,'Contributions calculator'!$D$4<=J15),'Contributions calculator'!$D$4,\"\")","v":""},{"$f":"IF(B15=\"\",\"\",IF(DAY(K15)>=DAY(B15),0,-1)+(YEAR(K15)-YEAR(B15))*12+MONTH(K15)-MONTH(B15))","v":""},{"$f":"IF(B15=\"\",\"\",ROUNDDOWN(C15/12,0))","v":""},"","","","1954-10-06",null,"1960-04-05",{"$f":"IF(AND('Contributions calculator'!D4>=H15,'Contributions calculator'!D4<=J15),('Contributions calculator'!D4+66*365.25),\"\")","v":""},null,""]
[null,null,null,null,null,null,null,null,null,null,null,null,""]
["Increase from 66 to 67",{"$f":"IF(AND('Contributions calculator'!$D$4>=H17,'Contributions calculator'!$D$4<=J17),'Contributions calculator'!$D$4,\"\")","v":""},null,{"$f":"IF(B17=\"\",\"\",66)","v":""},"",{"$f":"IF(B17=\"\",\"\",1)","v":""},null,"1960-04-06",null,"1960-05-05",null,null,""]
[null,{"$f":"IF(AND('Contributions calculator'!$D$4>=H18,'Contributions calculator'!$D$4<=J18),'Contributions calculator'!$D$4,\"\")","v":""},null,"","",{"$f":"IF(B18=\"\",\"\",2)","v":""},null,"1960-05-06",null,"1960-06-05",null,null,""]
[null,{"$f":"IF(AND('Contributions calculator'!$D$4>=H19,'Contributions calculator'!$D$4<=J19),'Contributions calculator'!$D$4,\"\")","v":""},null,"","",{"$f":"IF(B19=\"\",\"\",3)","v":""},null,"1960-06-06",null,"1960-07-05",null,null,""]
[null,{"$f":"IF(AND('Contributions calculator'!$D$4>=H20,'Contributions calculator'!$D$4<=J20),'Contributions calculator'!$D$4,\"\")","v":""},null,"","",{"$f":"IF(B20=\"\",\"\",4)","v":""},null,"1960-07-06",null,"1960-08-05",null,null,""]
[null,{"$f":"IF(AND('Contributions calculator'!$D$4>=H21,'Contributions calculator'!$D$4<=J21),'Contributions calculator'!$D$4,\"\")","v":""},null,"","",{"$f":"IF(B21=\"\",\"\",5)","v":""},null,"1960-08-06",null,"1960-09-05",null,null,""]
[null,{"$f":"IF(AND('Contributions calculator'!$D$4>=H22,'Contributions calculator'!$D$4<=J22),'Contributions calculator'!$D$4,\"\")","v":""},null,"","",{"$f":"IF(B22=\"\",\"\",6)","v":""},null,"1960-09-06",null,"1960-10-05",null,null,""]
[null,{"$f":"IF(AND('Contributions calculator'!$D$4>=H23,'Contributions calculator'!$D$4<=J23),'Contributions calculator'!$D$4,\"\")","v":""},null,"","",{"$f":"IF(B23=\"\",\"\",7)","v":""},null,"1960-10-06",null,"1960-11-05",null,null,{"$f":"IF(B23=\"\",\"\",DATE(YEAR(B23)+D23,MONTH(B23)+F23,DAY(B23)))","v":""}]
[null,{"$f":"IF(AND('Contributions calculator'!$D$4>=H24,'Contributions calculator'!$D$4<=J24),'Contributions calculator'!$D$4,\"\")","v":""},null,"","",{"$f":"IF(B24=\"\",\"\",8)","v":""},null,"1960-11-06",null,"1960-12-05",null,null,""]
[null,{"$f":"IF(AND('Contributions calculator'!$D$4>=H25,'Contributions calculator'!$D$4<=J25),'Contributions calculator'!$D$4,\"\")","v":""},null,"","",{"$f":"IF(B25=\"\",\"\",9)","v":""},null,"1960-12-06",null,"1961-01-05",null,null,""]
[null,{"$f":"IF(AND('Contributions calculator'!$D$4>=H26,'Contributions calculator'!$D$4<=J26),'Contributions calculator'!$D$4,\"\")","v":""},null,"","",{"$f":"IF(B26=\"\",\"\",10)","v":""},null,"1961-01-06",null,"1961-02-05",null,null,""]
[null,{"$f":"IF(AND('Contributions calculator'!$D$4>=H27,'Contributions calculator'!$D$4<=J27),'Contributions calculator'!$D$4,\"\")","v":""},null,"","",{"$f":"IF(B27=\"\",\"\",11)","v":""},null,"1961-02-06",null,"1961-03-05",null,null,""]
[null,{"$f":"IF(AND('Contributions calculator'!$D$4>=H28,'Contributions calculator'!$D$4<=J28),'Contributions calculator'!$D$4,\"\")","v":""},null,{"$f":"IF(B28=\"\",\"\",67)","v":""},"",{"$f":"IF(B28=\"\",\"\",1)","v":""},null,"1961-03-06",null,"1977-04-05",null,null,""]
[null,null,null,null,null,null,null,null,null,null,null,null,""]
["Increase from 67 to 68",{"$f":"IF(AND('Contributions calculator'!$D$4>=H30,'Contributions calculator'!$D$4<=J30),'Contributions calculator'!$D$4,\"\")","v":""},{"$f":"IF(B30=\"\",\"\",IF(DAY(K30)>=DAY(B30),0,-1)+(YEAR(K30)-YEAR(B30))*12+MONTH(K30)-MONTH(B30))","v":""},{"$f":"IF(B30=\"\",\"\",ROUNDDOWN(C30/12,0))","v":""},"",{"$f":"IF(B30=\"\",\"\",C30-(D30*12))","v":""},"","1977-04-06",null,"1977-05-05","2044-05-06",null,""]
[null,{"$f":"IF(AND('Contributions calculator'!$D$4>=H31,'Contributions calculator'!$D$4<=J31),'Contributions calculator'!$D$4,\"\")","v":""},"",{"$f":"IF(B31=\"\",\"\",ROUNDDOWN(C31/12,0))","v":""},"",{"$f":"IF(B31=\"\",\"\",C31-(D31*12))","v":""},"","1977-05-06",null,"1977-06-05","2044-07-06",null,""]
[null,{"$f":"IF(AND('Contributions calculator'!$D$4>=H32,'Contributions calculator'!$D$4<=J32),'Contributions calculator'!$D$4,\"\")","v":""},"","","","","","1977-06-06",null,"1977-07-05","2044-09-06",null,""]
[null,{"$f":"IF(AND('Contributions calculator'!$D$4>=H33,'Contributions calculator'!$D$4<=J33),'Contributions calculator'!$D$4,\"\")","v":""},"","","","","","1977-07-06",null,"1977-08-05","2044-11-06",null,""]
[null,{"$f":"IF(AND('Contributions calculator'!$D$4>=H34,'Contributions calculator'!$D$4<=J34),'Contributions calculator'!$D$4,\"\")","v":""},"","","","","","1977-08-06",null,"1977-09-05","2045-01-06",null,""]
[null,{"$f":"IF(AND('Contributions calculator'!$D$4>=H35,'Contributions calculator'!$D$4<=J35),'Contributions calculator'!$D$4,\"\")","v":""},"","","","","","1977-09-06",null,"1977-10-05","2045-03-06",null,""]
[null,{"$f":"IF(AND('Contributions calculator'!$D$4>=H36,'Contributions calculator'!$D$4<=J36),'Contributions calculator'!$D$4,\"\")","v":""},"","","","","","1977-10-06",null,"1977-11-05","2045-05-06",null,""]
[null,{"$f":"IF(AND('Contributions calculator'!$D$4>=H37,'Contributions calculator'!$D$4<=J37),'Contributions calculator'!$D$4,\"\")","v":""},"","","","","","1977-11-06",null,"1977-12-05","2045-07-06",null,""]
[null,{"$f":"IF(AND('Contributions calculator'!$D$4>=H38,'Contributions calculator'!$D$4<=J38),'Contributions calculator'!$D$4,\"\")","v":""},"","","","","","1977-12-06",null,"1978-01-05","2045-09-06",null,""]
[null,{"$f":"IF(AND('Contributions calculator'!$D$4>=H39,'Contributions calculator'!$D$4<=J39),'Contributions calculator'!$D$4,\"\")","v":""},"","","","","","1978-01-06",null,"1978-02-05","2045-11-06",null,""]
[null,{"$f":"IF(AND('Contributions calculator'!$D$4>=H40,'Contributions calculator'!$D$4<=J40),'Contributions calculator'!$D$4,\"\")","v":""},"","","","","","1978-02-06",null,"1978-03-05","2046-01-06",null,""]
[null,{"$f":"IF(AND('Contributions calculator'!$D$4>=H41,'Contributions calculator'!$D$4<=J41),'Contributions calculator'!$D$4,\"\")","v":""},"","","","","","1978-03-06",null,"1978-04-05","2046-03-06",null,""]
[null,{"$f":"IF(AND('Contributions calculator'!$D$4>=H42,'Contributions calculator'!$D$4<=J42),'Contributions calculator'!$D$4,\"\")","v":""},null,{"$f":"IF(B42=\"\",\"\",68)","v":""},null,null,"","1978-04-06",null,{"$f":"TODAY()","v":"2020-09-07"},null,null,""]

{"sheet":"Lump Sum","index":3,"n_rows":58,"n_cols":12,"rows_kept":58,"cut":false,"hidden":true,"merged":[[7,10,7,11],[7,2,7,3],[7,6,7,7]]}
[null,null,null,null,null,null,"Lump Sum Elections"]
[]
[]
[null,"NPA 60",null,null,null,"NPA 65",null,null,null,"2015 Scheme"]
[null,"Table S60 -NPA 60 ",null,null,null,"Table SPA 65 - NPA 65",null,null,null,"Table S"]
[]
[null,"Benefits","Personal","Personal and dependant's",null,"Benefits","Personal","Personal and dependant's",null,"Benefits","Personal","Personal and dependant's"]
[null,"Age when notice of election given","Single premium to purchase £250 of APB at date of election, £",null,null,"Age when notice of election given","Single premium to purchase £250 of APB at date of election, £",null,null,"Age when notice of election given","Single premium to purchase £250 of APB at date of election, £"]
[null,16,2080,2180,null,16,1700,1810,null,16,1510,1630]
[null,17,2120,2230,null,17,1740,1850,null,17,1550,1660]
[null,18,2170,2280,null,18,1780,1900,null,18,1580,1700]
[null,19,2220,2330,null,19,1820,1940,null,19,1610,1740]
[null,20,2260,2380,null,20,1860,1980,null,20,1650,1770]
[null,21,2310,2440,null,21,1890,2020,null,21,1680,1810]
[null,22,2360,2490,null,22,1930,2060,null,22,1720,1850]
[null,23,2410,2540,null,23,1980,2110,null,23,1750,1890]
[null,24,2470,2600,null,24,2020,2150,null,24,1790,1920]
[null,25,2520,2650,null,25,2060,2200,null,25,1820,1960]
[null,26,2570,2710,null,26,2100,2240,null,26,1860,2000]
[null,27,2630,2770,null,27,2150,2290,null,27,1900,2050]
[null,28,2690,2830,null,28,2190,2340,null,28,1940,2090]
[null,29,2740,2890,null,29,2240,2380,null,29,1980,2130]
[null,30,2800,2950,null,30,2280,2430,null,30,2020,2170]
[null,31,2860,3010,null,31,2330,2480,null,31,2060,2220]
[null,32,2920,3080,null,32,2380,2540,null,32,2100,2260]
[null,33,2990,3140,null,33,2430,2590,null,33,2140,2310]
[null,34,3050,3210,null,34,2480,2640,null,34,2190,2350]
[null,35,3120,3270,null,35,2530,2690,null,35,2230,2400]
[null,36,3180,3340,null,36,2580,2750,null,36,2280,2450]
[null,37,3250,3410,null,37,2630,2810,null,37,2320,2500]
[null,38,3320,3490,null,38,2690,2860,null,38,2370,2540]
[null,39,3390,3560,null,39,2740,2920,null,39,2410,2590]
[null,40,3460,3640,null,40,2800,2980,null,40,2460,2650]
[null,41,3530,3710,null,41,2860,3040,null,41,2510,2700]
[null,42,3610,3790,null,42,2910,3100,null,42,2590,2780]
[null,43,3690,3870,null,43,2970,3160,null,43,2670,2860]
[null,44,3770,3950,null,44,3030,3220,null,44,2750,2940]
[null,45,3850,4030,null,45,3090,3290,null,45,2830,3030]
[null,46,3930,4120,null,46,3160,3350,null,46,2890,3090]
[null,47,4010,4200,null,47,3220,3420,null,47,2950,3150]
[null,48,4100,4290,null,48,3290,3490,null,48,3000,3210]
[null,49,4190,4380,null,49,3350,3560,null,49,3060,3270]
[null,50,4280,4480,null,50,3420,3630,null,50,3120,3340]
[null,51,4370,4570,null,51,3490,3700,null,51,3190,3400]
[null,52,4470,4670,null,52,3560,3770,null,52,3250,3460]
[null,53,4560,4770,null,53,3630,3850,null,53,3310,3530]
[null,54,4660,4870,null,54,3700,3920,null,54,3370,3590]
[null,55,4770,4980,null,55,3780,4000,null,55,3440,3660]
[null,56,4880,5090,null,56,3860,4080,null,56,3500,3730]
[null,57,4990,5200,null,57,3930,4160,null,57,3570,3790]
[null,58,5110,5320,null,58,4020,4240,null,58,3640,3860]
[null,59,5230,5450,null,59,4100,4320,null,59,3760,3990]
[null,60,null,null,null,60,4190,4410,null,60,3880,4110]
[null,61,null,null,null,61,4280,4510,null,61,4020,4250]
[null,62,null,null,null,62,4380,4610,null,62,4160,4390]
[null,63,null,null,null,63,4490,4710,null,63,4260,4480]
[null,64,null,null,null,64,4600,4830,null,64,4360,4590]
[null,null,null,null,null,null,null,null,null,65,4470,4700]

{"sheet":"NRA60","index":4,"n_rows":49,"n_cols":43,"rows_kept":49,"cut":false,"hidden":true,"merged":[[4,1,4,20],[4,23,4,42]]}
[]
["Regular Contribution Elections made after 31 March 2011",null,null,null,null,null,null,null,null,null,null,null,null,null,null,null,null,null,null,null,null,null,"Regular Contribution Elections made after 31 March 2011"]
["Table D60: Personal and Dependant's Benefits, NRA 60",null,null,null,null,null,null,null,null,null,null,null,null,null,null,null,null,null,null,null,null,null,"Table P60: Personal Benefits, NRA 60 "]
[]
["Age when notice of election given\nâ","Monthly contribution to purchase £250 of APB at date of election, £",null,null,null,null,null,null,null,null,null,null,null,null,null,null,null,null,null,null,null,null,"Age when notice of election given\nâ","Monthly contribution to purchase £250 of APB at date of election, £"]
["Payment period (in years) à",1,2,3,4,5,6,7,8,9,10,11,12,13,14,15,16,17,18,19,20,null,"Payment period (in years) à",1,2,3,4,5,6,7,8,9,10,11,12,13,14,15,16,17,18,19,20]
[16,297.60000000000002,152.1,103.6,79.400000000000006,64.900000000000006,55.2,48.3,43.2,39.200000000000003,36,33.4,31.2,29.4,27.8,26.5,25.3,24.3,23.4,22.6,21.9,null,16,284.2,145.19999999999999,98.9,75.8,61.9,52.7,46.1,41.2,37.4,34.299999999999997,31.9,29.8,28.1,26.6,25.3,24.2,23.2,22.4,21.6,20.9]
[17,301.10000000000002,153.80000000000001,104.8,80.3,65.599999999999994,55.8,48.9,43.7,39.6,36.4,33.799999999999997,31.6,29.7,28.2,26.8,25.6,24.6,23.7,22.9,22.2,null,17,287.2,146.69999999999999,100,76.599999999999994,62.6,53.3,46.6,41.7,37.799999999999997,34.700000000000003,32.200000000000003,30.1,28.4,26.9,25.6,24.5,23.5,22.6,21.8,21.1]
[18,304.7,155.69999999999999,106.1,81.3,66.400000000000006,56.5,49.5,44.2,40.1,36.799999999999997,34.200000000000003,32,30.1,28.5,27.1,26,24.9,24,23.2,22.4,null,18,290.3,148.30000000000001,101,77.400000000000006,63.3,53.8,47.1,42.1,38.200000000000003,35.1,32.6,30.5,28.7,27.2,25.9,24.7,23.7,22.8,22.1,21.4]
[19,308.2,157.5,107.3,82.2,67.2,57.2,50,44.7,40.6,37.299999999999997,34.6,32.299999999999997,30.5,28.9,27.5,26.3,25.2,24.3,23.4,22.7,null,19,293.3,149.9,102.1,78.2,63.9,54.4,47.6,42.6,38.6,35.5,32.9,30.8,29,27.5,26.1,25,24,23.1,22.3,21.6]
[20,311.39999999999998,159.1,108.4,83.1,67.900000000000006,57.8,50.6,45.2,41,37.700000000000003,34.9,32.700000000000003,30.8,29.2,27.8,26.5,25.5,24.5,23.7,22.9,null,20,296.39999999999998,151.5,103.2,79.099999999999994,64.599999999999994,55,48.1,43,39,35.799999999999997,33.299999999999997,31.1,29.3,27.8,26.4,25.3,24.2,23.3,22.5,21.8]
[21,314.7,160.80000000000001,109.5,83.9,68.599999999999994,58.4,51.1,45.7,41.4,38.1,35.299999999999997,33,31.1,29.5,28.1,26.8,25.7,24.8,23.9,23.2,null,21,299.60000000000002,153.1,104.3,79.900000000000006,65.3,55.6,48.6,43.5,39.4,36.200000000000003,33.6,31.4,29.6,28.1,26.7,25.5,24.5,23.6,22.8,22.1]
[22,318,162.5,110.7,84.8,69.3,59,51.6,46.1,41.9,38.5,35.700000000000003,33.4,31.4,29.8,28.4,27.1,26,25.1,24.2,23.4,null,22,302.7,154.69999999999999,105.4,80.7,66,56.2,49.2,43.9,39.9,36.6,34,31.8,29.9,28.3,27,25.8,24.8,23.8,23,22.3]
[23,321.3,164.2,111.8,85.7,70,59.6,52.2,46.6,42.3,38.9,36.1,33.700000000000003,31.8,30.1,28.7,27.4,26.3,25.3,24.5,23.7,null,23,305.89999999999998,156.30000000000001,106.5,81.599999999999994,66.7,56.8,49.7,44.4,40.299999999999997,37,34.299999999999997,32.1,30.2,28.7,27.3,26.1,25,24.1,23.3,22.5]
[24,324.60000000000002,165.9,113,86.6,70.8,60.2,52.7,47.1,42.8,39.299999999999997,36.4,34.1,32.1,30.4,29,27.7,26.6,25.6,24.7,23.9,null,24,309.10000000000002,157.9,107.6,82.4,67.400000000000006,57.3,50.2,44.8,40.700000000000003,37.4,34.700000000000003,32.5,30.6,29,27.6,26.4,25.3,24.4,23.5,22.8]
[25,328,167.6,114.2,87.5,71.5,60.9,53.3,47.6,43.2,39.700000000000003,36.799999999999997,34.5,32.5,30.7,29.3,28,26.9,25.9,25,24.2,null,25,312.3,159.6,108.7,83.3,68.099999999999994,57.9,50.7,45.3,41.1,37.799999999999997,35.1,32.799999999999997,30.9,29.3,27.9,26.6,25.6,24.6,23.8,23]
[26,331.4,169.4,115.4,88.4,72.3,61.5,53.8,48.1,43.7,40.1,37.200000000000003,34.799999999999997,32.799999999999997,31.1,29.6,28.3,27.2,26.2,25.3,24.5,null,26,315.5,161.19999999999999,109.8,84.2,68.8,58.6,51.3,45.8,41.6,38.200000000000003,35.4,33.200000000000003,31.2,29.6,28.2,26.9,25.9,24.9,24.1,23.3]
[27,334.8,171.1,116.6,89.3,73,62.1,54.4,48.6,44.1,40.5,37.6,35.200000000000003,33.1,31.4,29.9,28.6,27.5,26.4,25.5,24.7,null,27,318.8,162.9,111,85.1,69.5,59.2,51.8,46.3,42,38.6,35.799999999999997,33.5,31.6,29.9,28.5,27.2,26.1,25.2,24.3,23.6]
[28,338.3,172.9,117.8,90.3,73.8,62.8,55,49.1,44.6,41,38,35.6,33.5,31.7,30.2,28.9,27.8,26.7,25.8,25,null,28,322.10000000000002,164.6,112.2,85.9,70.2,59.8,52.3,46.8,42.5,39,36.200000000000003,33.9,31.9,30.2,28.8,27.5,26.4,25.5,24.6,23.8]
[29,341.8,174.7,119,91.2,74.5,63.5,55.6,49.6,45.1,41.4,38.4,36,33.9,32.1,30.6,29.2,28.1,27,26.1,25.3,null,29,325.5,166.3,113.3,86.8,71,60.4,52.9,47.3,42.9,39.4,36.6,34.200000000000003,32.299999999999997,30.6,29.1,27.8,26.7,25.7,24.9,24.1]
[30,345.4,176.5,120.3,92.2,75.3,64.099999999999994,56.1,50.2,45.5,41.9,38.799999999999997,36.299999999999997,34.200000000000003,32.4,30.9,29.6,28.4,27.3,26.4,25.6,null,30,328.9,168.1,114.5,87.8,71.7,61.1,53.5,47.8,43.4,39.9,37,34.6,32.6,30.9,29.4,28.1,27,26,25.1,24.4]
[31,348.9,178.3,121.5,93.1,76.099999999999994,64.8,56.7,50.7,46,42.3,39.299999999999997,36.700000000000003,34.6,32.799999999999997,31.2,29.9,28.7,27.6,26.7,25.9,null,31,332.3,169.8,115.7,88.7,72.5,61.7,54,48.3,43.8,40.299999999999997,37.4,35,33,31.2,29.7,28.5,27.3,26.3,25.4,24.6]
[32,352.5,180.2,122.8,94.1,76.900000000000006,65.5,57.3,51.2,46.5,42.8,39.700000000000003,37.1,35,33.200000000000003,31.6,30.2,29,27.9,27,26.2,null,32,335.7,171.6,116.9,89.6,73.3,62.4,54.6,48.8,44.3,40.700000000000003,37.799999999999997,35.4,33.299999999999997,31.6,30.1,28.8,27.6,26.6,25.7,24.9]
[33,356.2,182.1,124.1,95.1,77.7,66.2,57.9,51.8,47,43.2,40.1,37.5,35.4,33.5,31.9,30.5,29.3,28.3,27.3,26.5,null,33,339.2,173.4,118.1,90.6,74,63,55.2,49.3,44.8,41.2,38.200000000000003,35.700000000000003,33.700000000000003,31.9,30.4,29.1,27.9,26.9,26,25.2]
[34,359.8,183.9,125.3,96.1,78.5,66.900000000000006,58.6,52.3,47.5,43.7,40.5,37.9,35.799999999999997,33.9,32.299999999999997,30.9,29.7,28.6,27.6,26.8,null,34,342.7,175.2,119.4,91.5,74.8,63.7,55.8,49.9,45.3,41.6,38.6,36.1,34.1,32.299999999999997,30.7,29.4,28.3,27.2,26.3,25.5]
[35,363.5,185.8,126.6,97.1,79.400000000000006,67.599999999999994,59.2,52.9,48,44.1,41,38.4,36.1,34.299999999999997,32.6,31.2,30,28.9,27.9,27.1,null,35,346.3,177,120.6,92.5,75.599999999999994,64.400000000000006,56.4,50.4,45.7,42,39,36.5,34.4,32.6,31.1,29.7,28.6,27.5,26.6,25.8]
[36,367.2,187.7,127.9,98.1,80.2,68.3,59.8,53.5,48.5,44.6,41.4,38.799999999999997,36.5,34.6,33,31.6,30.3,29.2,28.3,27.4,null,36,349.8,178.8,121.9,93.4,76.400000000000006,65,57,50.9,46.2,42.5,39.5,36.9,34.799999999999997,33,31.4,30.1,28.9,27.9,26.9,26.1]
[37,371,189.7,129.30000000000001,99.1,81,69,60.4,54,49.1,45.1,41.9,39.200000000000003,37,35,33.4,31.9,30.7,29.6,28.6,27.7,null,37,353.4,180.7,123.1,94.4,77.2,65.7,57.6,51.5,46.7,43,39.9,37.299999999999997,35.200000000000003,33.4,31.8,30.4,29.2,28.2,27.3,26.4]
[38,374.8,191.6,130.6,100.1,81.900000000000006,69.7,61.1,54.6,49.6,45.6,42.3,39.6,37.4,35.4,33.799999999999997,32.299999999999997,31.1,29.9,29,28.1,null,38,357.1,182.6,124.4,95.4,78,66.400000000000006,58.2,52,47.3,43.4,40.299999999999997,37.799999999999997,35.6,33.799999999999997,32.200000000000003,30.8,29.6,28.5,27.6,26.8]
[39,378.6,193.6,131.9,101.2,82.7,70.5,61.7,55.2,50.1,46.1,42.8,40.1,37.799999999999997,35.799999999999997,34.200000000000003,32.700000000000003,31.4,30.3,29.3,28.5,null,39,360.8,184.5,125.7,96.4,78.8,67.2,58.8,52.6,47.8,43.9,40.799999999999997,38.200000000000003,36,34.200000000000003,32.6,31.2,30,28.9,28,27.1]
[40,382.5,195.6,133.30000000000001,102.2,83.6,71.2,62.4,55.8,50.7,46.6,43.3,40.5,38.200000000000003,36.299999999999997,34.6,33.1,31.8,30.7,29.7,null,null,40,364.5,186.4,127.1,97.4,79.7,67.900000000000006,59.5,53.2,48.3,44.4,41.3,38.6,36.4,34.6,32.9,31.6,30.3,29.3,28.3]
[41,386.4,197.6,134.69999999999999,103.3,84.5,72,63.1,56.4,51.2,47.1,43.8,41,38.700000000000003,36.700000000000003,35,33.5,32.200000000000003,31.1,null,null,null,41,368.3,188.3,128.4,98.5,80.5,68.599999999999994,60.1,53.8,48.8,44.9,41.7,39.1,36.9,35,33.4,31.9,30.7,29.6]
[42,390.3,199.6,136.1,104.4,85.4,72.8,63.8,57,51.8,47.7,44.3,41.5,39.1,37.1,35.4,33.9,32.700000000000003,null,null,null,null,42,372.1,190.3,129.80000000000001,99.5,81.400000000000006,69.400000000000006,60.8,54.4,49.4,45.4,42.2,39.5,37.299999999999997,35.4,33.799999999999997,32.4,31.1]
[43,394.3,201.7,137.5,105.5,86.3,73.5,64.400000000000006,57.6,52.4,48.2,44.8,42,39.6,37.6,35.9,34.4,null,null,null,null,null,43,376,192.3,131.1,100.6,82.3,70.099999999999994,61.5,55,50,46,42.7,40,37.799999999999997,35.9,34.200000000000003,32.799999999999997]
[44,398.3,203.8,139,106.6,87.2,74.3,65.099999999999994,58.3,53,48.8,45.3,42.5,40.1,38.1,36.299999999999997,null,null,null,null,null,null,44,379.9,194.3,132.5,101.7,83.2,70.900000000000006,62.1,55.6,50.5,46.5,43.2,40.5,38.200000000000003,36.299999999999997,34.700000000000003]
[45,402.4,205.9,140.4,107.7,88.1,75.099999999999994,65.900000000000006,58.9,53.6,49.3,45.9,43,40.6,38.6,null,null,null,null,null,null,null,45,383.9,196.4,133.9,102.8,84.1,71.7,62.8,56.2,51.1,47.1,43.8,41,38.700000000000003,36.799999999999997]
[46,406.5,208,141.9,108.9,89.1,76,66.599999999999994,59.6,54.2,49.9,46.5,43.6,41.2,null,null,null,null,null,null,null,null,46,387.9,198.5,135.4,103.9,85,72.5,63.6,56.9,51.7,47.6,44.3,41.6,39.299999999999997]
[47,410.7,210.2,143.4,110,90.1,76.8,67.400000000000006,60.3,54.9,50.6,47.1,44.2,null,null,null,null,null,null,null,null,null,47,392,200.6,136.80000000000001,105,86,73.3,64.3,57.6,52.4,48.3,44.9,42.2]
[48,414.9,212.4,144.9,111.2,91.1,77.7,68.2,61.1,55.6,51.2,47.7,null,null,null,null,null,null,null,null,null,null,48,396.1,202.7,138.30000000000001,106.2,87,74.2,65.099999999999994,58.3,53.1,48.9,45.6]
[49,419.3,214.6,146.5,112.5,92.2,78.7,69.099999999999994,61.9,56.4,52,null,null,null,null,null,null,null,null,null,null,null,49,400.4,205,139.9,107.4,88,75.099999999999994,66,59.1,53.8,49.6]
[50,423.7,217,148.19999999999999,113.9,93.3,79.7,70,62.8,57.2,null,null,null,null,null,null,null,null,null,null,null,null,50,404.8,207.3,141.6,108.8,89.1,76.099999999999994,66.900000000000006,59.9,54.6]
[51,428.3,219.5,149.9,115.2,94.5,80.7,70.900000000000006,63.6,null,null,null,null,null,null,null,null,null,null,null,null,null,51,409.3,209.7,143.30000000000001,110.1,90.3,77.099999999999994,67.8,60.8]
[52,433,221.9,151.69999999999999,116.7,95.7,81.8,71.900000000000006,null,null,null,null,null,null,null,null,null,null,null,null,null,null,52,413.9,212.2,145,111.5,91.5,78.2,68.7]
[53,437.7,224.5,153.5,118.1,96.9,82.9,null,null,null,null,null,null,null,null,null,null,null,null,null,null,null,53,418.7,214.7,146.80000000000001,113,92.7,79.3]
[54,442.5,227.1,155.4,119.6,98.2,null,null,null,null,null,null,null,null,null,null,null,null,null,null,null,null,54,423.5,217.3,148.69999999999999,114.4,94]
[55,447.5,229.8,157.30000000000001,121.1,null,null,null,null,null,null,null,null,null,null,null,null,null,null,null,null,null,55,428.5,220,150.6,116]
[56,452.7,232.5,159.30000000000001,null,null,null,null,null,null,null,null,null,null,null,null,null,null,null,null,null,null,56,433.8,222.8,152.6]
[57,458.1,235.4,null,null,null,null,null,null,null,null,null,null,null,null,null,null,null,null,null,null,null,57,439.3,225.7]
[58,463.8,null,null,null,null,null,null,null,null,null,null,null,null,null,null,null,null,null,null,null,null,58,445]

{"sheet":"NRA65","index":5,"n_rows":55,"n_cols":43,"rows_kept":55,"cut":false,"hidden":true,"merged":[[4,1,4,20],[4,23,4,42]]}
[]
["Regular Contribution Elections",null,null,null,null,null,null,null,null,null,null,null,null,null,null,null,null,null,null,null,null,null,"Regular Contribution Elections"]
["Table D65: Personal and Dependant’s Benefits, NRA 65",null,null,null,null,null,null,null,null,null,null,null,null,null,null,null,null,null,null,null,null,null,"Table P65: Personal Benefits, NRA 65 "]
[]
["Age when notice of election given\nâ","Monthly contribution to purchase £250 of APB at date of election, £",null,null,null,null,null,null,null,null,null,null,null,null,null,null,null,null,null,null,null,null,"Age when notice of election given\nâ","Monthly contribution to purchase £250 of APB at date of election, £"]
["Payment period (in years) à",1,2,3,4,5,6,7,8,9,10,11,12,13,14,15,16,17,18,19,20,null,"Payment period (in years) à",1,2,3,4,5,6,7,8,9,10,11,12,13,14,15,16,17,18,19,20]
[16,154.4,78.900000000000006,53.7,41.2,33.700000000000003,28.6,25.1,22.4,20.3,18.7,17.3,16.2,15.3,14.4,13.8,13.1,12.6,12.1,11.7,11.4,null,16,145.19999999999999,74.2,50.5,38.700000000000003,31.6,26.9,23.6,21.1,19.100000000000001,17.5,16.3,15.2,14.3,13.6,12.9,12.4,11.9,11.4,11,10.7]
[17,157.9,80.7,55,42.1,34.4,29.3,25.6,22.9,20.8,19.100000000000001,17.7,16.600000000000001,15.6,14.8,14.1,13.4,12.9,12.4,12,11.6,null,17,148.30000000000001,75.8,51.6,39.6,32.299999999999997,27.5,24.1,21.5,19.5,17.899999999999999,16.600000000000001,15.6,14.7,13.9,13.2,12.6,12.1,11.7,11.3,10.9]
[18,161.5,82.5,56.2,43.1,35.200000000000003,30,26.2,23.4,21.3,19.5,18.100000000000001,16.899999999999999,16,15.1,14.4,13.8,13.2,12.7,12.3,11.9,null,18,151.5,77.400000000000006,52.7,40.4,33,28.1,24.6,22,19.899999999999999,18.3,17,15.9,15,14.2,13.5,12.9,12.4,11.9,11.5,11.1]
[19,165.2,84.4,57.5,44.1,36,30.6,26.8,24,21.7,20,18.5,17.3,16.3,15.5,14.7,14.1,13.5,13,12.6,12.2,null,19,154.69999999999999,79.099999999999994,53.9,41.3,33.700000000000003,28.7,25.1,22.4,20.399999999999999,18.7,17.399999999999999,16.2,15.3,14.5,13.8,13.2,12.7,12.2,11.8,11.4]
[20,168.7,86.2,58.7,45,36.799999999999997,31.3,27.4,24.5,22.2,20.399999999999999,18.899999999999999,17.7,16.7,15.8,15,14.4,13.8,13.3,12.8,12.4,null,20,158,80.8,55,42.2,34.4,29.3,25.7,22.9,20.8,19.100000000000001,17.7,16.600000000000001,15.6,14.8,14.1,13.5,12.9,12.4,12,11.6]
[21,172.2,88,59.9,45.9,37.5,31.9,28,25,22.7,20.8,19.3,18.100000000000001,17,16.100000000000001,15.4,14.7,14.1,13.6,13.1,12.7,null,21,161.4,82.5,56.2,43,35.200000000000003,29.9,26.2,23.4,21.2,19.5,18.100000000000001,16.899999999999999,16,15.1,14.4,13.8,13.2,12.7,12.3,11.9]
[22,175.8,89.8,61.2,46.9,38.299999999999997,32.6,28.6,25.5,23.1,21.3,19.7,18.5,17.399999999999999,16.5,15.7,15,14.4,13.9,13.4,13,null,22,164.8,84.2,57.4,44,35.9,30.6,26.8,23.9,21.7,19.899999999999999,18.5,17.3,16.3,15.4,14.7,14,13.5,13,12.5,12.1]
[23,179.5,91.7,62.5,47.9,39.1,33.299999999999997,29.2,26,23.6,21.7,20.100000000000001,18.8,17.8,16.8,16,15.3,14.7,14.1,13.7,13.2,null,23,168.3,86,58.6,44.9,36.700000000000003,31.2,27.3,24.4,22.2,20.399999999999999,18.899999999999999,17.7,16.600000000000001,15.8,15,14.3,13.8,13.3,12.8,12.4]
[24,183.2,93.6,63.8,48.9,39.9,34,29.8,26.6,24.1,22.2,20.6,19.2,18.100000000000001,17.2,16.3,15.6,15,14.4,14,13.5,null,24,171.8,87.8,59.8,45.8,37.5,31.9,27.9,24.9,22.6,20.8,19.3,18,17,16.100000000000001,15.3,14.7,14.1,13.5,13.1,12.7]
[25,187.1,95.6,65.099999999999994,49.9,40.799999999999997,34.700000000000003,30.4,27.1,24.6,22.6,21,19.600000000000001,18.5,17.5,16.7,16,15.3,14.8,14.3,13.8,null,25,175.4,89.6,61.1,46.8,38.200000000000003,32.5,28.5,25.5,23.1,21.2,19.7,18.399999999999999,17.399999999999999,16.399999999999999,15.7,15,14.4,13.8,13.4,12.9]
[26,191,97.6,66.5,50.9,41.6,35.4,31,27.7,25.2,23.1,21.4,20.100000000000001,18.899999999999999,17.899999999999999,17,16.3,15.6,15.1,14.6,14.1,null,26,179.1,91.5,62.3,47.8,39,33.200000000000003,29.1,26,23.6,21.7,20.100000000000001,18.8,17.7,16.8,16,15.3,14.7,14.1,13.7,13.2]
[27,194.9,99.6,67.900000000000006,52,42.5,36.200000000000003,31.7,28.3,25.7,23.6,21.9,20.5,19.3,18.3,17.399999999999999,16.7,16,15.4,14.9,14.4,null,27,182.8,93.4,63.6,48.8,39.9,33.9,29.7,26.5,24.1,22.1,20.5,19.2,18.100000000000001,17.100000000000001,16.3,15.6,15,14.4,13.9,13.5]
[28,199,101.7,69.3,53.1,43.4,36.9,32.299999999999997,28.9,26.2,24.1,22.4,20.9,19.7,18.7,17.8,17,16.3,15.7,15.2,14.7,null,28,186.6,95.4,65,49.8,40.700000000000003,34.6,30.3,27.1,24.6,22.6,21,19.600000000000001,18.5,17.5,16.7,15.9,15.3,14.7,14.2,13.8]
[29,203.1,103.8,70.7,54.2,44.3,37.700000000000003,33,29.5,26.8,24.6,22.8,21.4,20.100000000000001,19.100000000000001,18.2,17.399999999999999,16.7,16.100000000000001,15.5,15,null,29,190.5,97.4,66.3,50.8,41.6,35.4,31,27.7,25.1,23.1,21.4,20,18.899999999999999,17.899999999999999,17,16.3,15.6,15.1,14.6,14.1]
[30,207.4,106,72.2,55.3,45.2,38.5,33.700000000000003,30.1,27.3,25.1,23.3,21.8,20.6,19.5,18.600000000000001,17.7,17,16.399999999999999,15.9,15.4,null,30,194.5,99.4,67.7,51.9,42.4,36.1,31.6,28.3,25.7,23.6,21.9,20.5,19.3,18.3,17.399999999999999,16.600000000000001,16,15.4,14.9,14.4]
[31,211.7,108.2,73.7,56.5,46.2,39.299999999999997,34.4,30.8,27.9,25.7,23.8,22.3,21,19.899999999999999,18.899999999999999,18.100000000000001,17.399999999999999,16.8,16.2,15.7,null,31,198.6,101.5,69.2,53,43.3,36.9,32.299999999999997,28.9,26.2,24.1,22.3,20.9,19.7,18.7,17.8,17,16.3,15.7,15.2,14.7]
[32,216.1,110.4,75.2,57.7,47.1,40.1,35.1,31.4,28.5,26.2,24.3,22.8,21.4,20.3,19.399999999999999,18.5,17.8,17.100000000000001,16.600000000000001,16,null,32,202.7,103.6,70.599999999999994,54.1,44.2,37.700000000000003,33,29.5,26.8,24.6,22.8,21.4,20.100000000000001,19.100000000000001,18.2,17.399999999999999,16.7,16.100000000000001,15.5,15]
[33,220.5,112.7,76.8,58.9,48.1,41,35.9,32.1,29.1,26.8,24.8,23.2,21.9,20.8,19.8,18.899999999999999,18.2,17.5,16.899999999999999,16.399999999999999,null,33,206.9,105.8,72.099999999999994,55.2,45.2,38.4,33.700000000000003,30.1,27.3,25.1,23.3,21.8,20.5,19.5,18.5,17.7,17,16.399999999999999,15.9,15.4]
[34,225,115,78.400000000000006,60.1,49.1,41.8,36.6,32.700000000000003,29.7,27.3,25.4,23.7,22.4,21.2,20.2,19.3,18.5,17.899999999999999,17.3,16.7,null,34,211.2,108,73.599999999999994,56.4,46.1,39.299999999999997,34.4,30.7,27.9,25.6,23.8,22.3,21,19.899999999999999,18.899999999999999,18.100000000000001,17.399999999999999,16.8,16.2,15.7]
[35,229.6,117.4,80,61.3,50.1,42.7,37.4,33.4,30.3,27.9,25.9,24.2,22.8,21.6,20.6,19.7,18.899999999999999,18.3,17.7,17.100000000000001,null,35,215.5,110.2,75.099999999999994,57.6,47.1,40.1,35.1,31.4,28.5,26.2,24.3,22.7,21.4,20.3,19.399999999999999,18.5,17.8,17.100000000000001,16.600000000000001,16.100000000000001]
[36,234.3,119.8,81.599999999999994,62.6,51.2,43.6,38.200000000000003,34.1,31,28.5,26.4,24.7,23.3,22.1,21.1,20.2,19.399999999999999,18.7,18,17.5,null,36,220,112.5,76.599999999999994,58.7,48,40.9,35.799999999999997,32,29.1,26.7,24.8,23.2,21.9,20.8,19.8,18.899999999999999,18.2,17.5,16.899999999999999,16.399999999999999]
[37,239.1,122.2,83.3,63.9,52.2,44.5,38.9,34.799999999999997,31.6,29.1,27,25.3,23.8,22.6,21.5,20.6,19.8,19.100000000000001,18.399999999999999,17.899999999999999,null,37,224.5,114.8,78.2,60,49,41.8,36.6,32.700000000000003,29.7,27.3,25.3,23.7,22.4,21.2,20.2,19.3,18.600000000000001,17.899999999999999,17.3,16.8]
[38,243.9,124.7,85,65.2,53.3,45.4,39.799999999999997,35.5,32.299999999999997,29.7,27.6,25.8,24.3,23.1,22,21,20.2,19.5,18.899999999999999,18.3,null,38,229.1,117.1,79.8,61.2,50,42.6,37.299999999999997,33.4,30.3,27.9,25.9,24.2,22.8,21.7,20.6,19.8,19,18.3,17.7,17.2]
[39,248.9,127.2,86.7,66.5,54.4,46.3,40.6,36.299999999999997,33,30.3,28.1,26.3,24.8,23.6,22.5,21.5,20.7,19.899999999999999,19.3,18.7,null,39,233.8,119.5,81.5,62.5,51.1,43.5,38.1,34.1,31,28.5,26.4,24.7,23.3,22.1,21.1,20.2,19.399999999999999,18.7,18.100000000000001,17.600000000000001]
[40,253.9,129.80000000000001,88.5,67.900000000000006,55.5,47.3,41.4,37,33.6,30.9,28.7,26.9,25.4,24.1,22.9,22,21.1,20.399999999999999,19.7,19.100000000000001,null,40,238.6,122,83.2,63.8,52.2,44.4,38.9,34.799999999999997,31.6,29.1,27,25.3,23.8,22.6,21.6,20.6,19.899999999999999,19.2,18.5,18]
[41,259.10000000000002,132.5,90.3,69.3,56.7,48.3,42.3,37.799999999999997,34.4,31.6,29.4,27.5,25.9,24.6,23.5,22.5,21.6,20.9,20.2,19.600000000000001,null,41,243.5,124.5,84.9,65.099999999999994,53.2,45.4,39.700000000000003,35.5,32.299999999999997,29.7,27.6,25.8,24.4,23.1,22,21.1,20.3,19.600000000000001,19,18.399999999999999]
[42,264.3,135.19999999999999,92.2,70.7,57.8,49.3,43.2,38.6,35.1,32.299999999999997,30,28.1,26.5,25.1,24,23,22.1,21.3,20.7,20.100000000000001,null,42,248.4,127.1,86.6,66.400000000000006,54.4,46.3,40.6,36.299999999999997,33,30.3,28.2,26.4,24.9,23.6,22.5,21.6,20.8,20.100000000000001,19.399999999999999,18.899999999999999]
[43,269.60000000000002,137.9,94,72.099999999999994,59,50.3,44.1,39.4,35.799999999999997,32.9,30.6,28.7,27.1,25.7,24.5,23.5,22.6,21.8,21.2,20.6,null,43,253.5,129.6,88.4,67.8,55.5,47.3,41.4,37.1,33.700000000000003,31,28.8,27,25.5,24.2,23.1,22.1,21.3,20.5,19.899999999999999,19.3]
[44,275,140.69999999999999,95.9,73.599999999999994,60.2,51.3,45,40.200000000000003,36.6,33.700000000000003,31.3,29.3,27.7,26.3,25.1,24.1,23.2,22.4,21.7,21.1,null,44,258.60000000000002,132.30000000000001,90.2,69.2,56.6,48.3,42.3,37.799999999999997,34.4,31.7,29.4,27.6,26,24.7,23.6,22.6,21.8,21,20.399999999999999,19.8]
[45,280.5,143.5,97.9,75.099999999999994,61.4,52.4,45.9,41.1,37.299999999999997,34.4,32,30,28.3,26.9,25.7,24.6,23.7,22.9,22.2,null,null,45,263.89999999999998,135,92.1,70.599999999999994,57.8,49.3,43.2,38.6,35.1,32.299999999999997,30.1,28.2,26.6,25.3,24.2,23.2,22.3,21.6,20.9]
[46,286.10000000000002,146.4,99.8,76.599999999999994,62.7,53.4,46.9,42,38.200000000000003,35.1,32.700000000000003,30.7,29,27.5,26.3,25.2,24.3,23.5,null,null,null,46,269.2,137.69999999999999,94,72.099999999999994,59,50.3,44.1,39.5,35.9,33.1,30.8,28.9,27.3,25.9,24.7,23.7,22.9,22.1]
[47,291.8,149.30000000000001,101.8,78.2,64,54.6,47.9,42.9,39,35.9,33.4,31.4,29.6,28.2,26.9,25.9,24.9,null,null,null,null,47,274.7,140.6,95.9,73.599999999999994,60.2,51.4,45.1,40.4,36.700000000000003,33.799999999999997,31.5,29.5,27.9,26.5,25.4,24.3,23.5]
[48,297.60000000000002,152.30000000000001,103.9,79.8,65.3,55.7,48.9,43.8,39.9,36.799999999999997,34.200000000000003,32.1,30.4,28.9,27.6,26.5,null,null,null,null,null,48,280.3,143.4,97.9,75.099999999999994,61.5,52.5,46.1,41.3,37.6,34.6,32.200000000000003,30.3,28.6,27.2,26,25]
[49,303.60000000000002,155.4,106.1,81.5,66.7,57,50,44.8,40.799999999999997,37.6,35,32.9,31.1,29.6,28.3,null,null,null,null,null,null,49,286,146.4,99.9,76.7,62.9,53.7,47.1,42.2,38.4,35.5,33,31,29.3,27.9,26.7]
[50,309.7,158.6,108.3,83.2,68.2,58.2,51.2,45.9,41.8,38.5,35.9,33.700000000000003,31.9,30.4,null,null,null,null,null,null,null,50,291.89999999999998,149.5,102.1,78.400000000000006,64.3,54.9,48.2,43.2,39.4,36.299999999999997,33.9,31.8,30.1,28.6]
[51,316,161.9,110.6,85,69.7,59.6,52.3,46.9,42.8,39.5,36.799999999999997,34.6,32.799999999999997,null,null,null,null,null,null,null,null,51,298,152.69999999999999,104.3,80.2,65.7,56.2,49.4,44.3,40.4,37.200000000000003,34.700000000000003,32.6,30.9]
[52,322.3,165.2,112.9,86.9,71.3,60.9,53.5,48,43.8,40.5,37.700000000000003,35.5,null,null,null,null,null,null,null,null,null,52,304.10000000000002,155.9,106.6,81.900000000000006,67.2,57.5,50.5,45.3,41.3,38.200000000000003,35.6,33.5]
[53,328.8,168.6,115.3,88.7,72.8,62.3,54.8,49.2,44.9,41.4,38.700000000000003,null,null,null,null,null,null,null,null,null,null,53,310.39999999999998,159.19999999999999,108.8,83.7,68.7,58.8,51.7,46.4,42.3,39.1,36.5]
[54,335.3,172,117.7,90.6,74.400000000000006,63.7,56,50.3,45.9,42.5,null,null,null,null,null,null,null,null,null,null,null,54,316.7,162.5,111.2,85.6,70.3,60.1,52.9,47.5,43.4,40.1]
[55,342,175.6,120.2,92.6,76.099999999999994,65.099999999999994,57.3,51.5,47,null,null,null,null,null,null,null,null,null,null,null,null,55,323.3,165.9,113.6,87.5,71.900000000000006,61.5,54.2,48.7,44.5]
[56,348.8,179.2,122.7,94.6,77.8,66.599999999999994,58.7,52.7,null,null,null,null,null,null,null,null,null,null,null,null,null,56,330,169.5,116.1,89.5,73.5,63,55.5,49.9]
[57,355.9,182.9,125.3,96.7,79.5,68.099999999999994,60,null,null,null,null,null,null,null,null,null,null,null,null,null,null,57,336.9,173.2,118.7,91.5,75.3,64.5,56.8]
[58,363.2,186.8,128.1,98.8,81.3,69.7,null,null,null,null,null,null,null,null,null,null,null,null,null,null,null,58,344.1,177,121.3,93.6,77,66]
[59,370.8,190.8,130.9,101,83.2,null,null,null,null,null,null,null,null,null,null,null,null,null,null,null,null,59,351.6,180.9,124.1,95.8,78.900000000000006]
[60,378.7,195,133.80000000000001,103.4,null,null,null,null,null,null,null,null,null,null,null,null,null,null,null,null,null,60,359.5,185.1,127.1,98.1]
[61,387.1,199.4,136.9,null,null,null,null,null,null,null,null,null,null,null,null,null,null,null,null,null,null,61,367.8,189.5,130.1]
[62,395.8,204,null,null,null,null,null,null,null,null,null,null,null,null,null,null,null,null,null,null,null,62,376.6,194.1]
[63,405.1,null,null,null,null,null,null,null,null,null,null,null,null,null,null,null,null,null,null,null,null,63,385.9]
[64," "," "," "," "," "," "," "," "," "," "," "," "," "," "," "," "," "," "," "," ",null,64,"","","","","","","","","","","","","","","","","","","",""]

{"sheet":"NRA66","index":6,"n_rows":55,"n_cols":43,"rows_kept":55,"cut":false,"hidden":true,"merged":[[4,1,4,20],[4,23,4,42]]}
[]
["Regular Contribution Elections",null,null,null,null,null,null,null,null,null,null,null,null,null,null,null,null,null,null,null,null,null,"Regular Contribution Elections"]
["Table D66: Personal and Dependant’s Benefits, NRA 66",null,null,null,null,null,null,null,null,null,null,null,null,null,null,null,null,null,null,null,null,null,"Table P66: Personal Benefits, NRA 66 "]
[]
["Age when notice of election given\nâ","Monthly contribution to purchase £250 of APB at date of election, £",null,null,null,null,null,null,null,null,null,null,null,null,null,null,null,null,null,null,null,null,"Age when notice of election given\nâ","Monthly contribution to purchase £250 of APB at date of election, £"]
["Payment period (in years) à",1,2,3,4,5,6,7,8,9,10,11,12,13,14,15,16,17,18,19,20,null,"Payment period (in years) à",1,2,3,4,5,6,7,8,9,10,11,12,13,14,15,16,17,18,19,20]
[16,148.9,76.099999999999994,51.8,39.700000000000003,32.4,27.6,24.2,21.6,19.600000000000001,18,16.7,15.6,14.7,13.9,13.3,12.7,12.2,11.7,11.3,10.9,null,16,139.5,71.3,48.6,37.200000000000003,30.4,25.9,22.6,20.2,18.399999999999999,16.899999999999999,15.6,14.6,13.8,13.1,12.4,11.9,11.4,11,10.6,10.3]
[17,152.19999999999999,77.8,53,40.6,33.200000000000003,28.2,24.7,22.1,20,18.399999999999999,17.100000000000001,16,15,14.2,13.6,13,12.4,12,11.6,11.2,null,17,142.5,72.8,49.6,38,31.1,26.4,23.1,20.7,18.8,17.2,16,15,14.1,13.3,12.7,12.1,11.6,11.2,10.8,10.5]
[18,155.69999999999999,79.599999999999994,54.2,41.5,33.9,28.9,25.3,22.6,20.5,18.8,17.5,16.3,15.4,14.6,13.9,13.3,12.7,12.3,11.8,11.5,null,18,145.6,74.400000000000006,50.7,38.799999999999997,31.7,27,23.6,21.1,19.2,17.600000000000001,16.3,15.3,14.4,13.6,13,12.4,11.9,11.5,11.1,10.7]
[19,159.19999999999999,81.400000000000006,55.4,42.5,34.700000000000003,29.5,25.9,23.1,21,19.3,17.899999999999999,16.7,15.7,14.9,14.2,13.6,13,12.5,12.1,11.7,null,19,148.69999999999999,76,51.8,39.700000000000003,32.4,27.6,24.1,21.6,19.600000000000001,18,16.7,15.6,14.7,13.9,13.3,12.7,12.2,11.7,11.3,10.9]
[20,162.6,83.1,56.6,43.4,35.4,30.2,26.4,23.6,21.4,19.7,18.2,17.100000000000001,16.100000000000001,15.2,14.5,13.9,13.3,12.8,12.4,12,null,20,151.80000000000001,77.599999999999994,52.9,40.5,33.1,28.2,24.7,22,20,18.399999999999999,17,15.9,15,14.2,13.5,12.9,12.4,12,11.5,11.2]
[21,165.9,84.8,57.8,44.3,36.200000000000003,30.8,26.9,24.1,21.8,20.100000000000001,18.600000000000001,17.399999999999999,16.399999999999999,15.5,14.8,14.1,13.6,13.1,12.6,12.2,null,21,155,79.2,54,41.4,33.799999999999997,28.8,25.2,22.5,20.399999999999999,18.7,17.399999999999999,16.3,15.3,14.5,13.8,13.2,12.7,12.2,11.8,11.4]
[22,169.4,86.6,59,45.2,36.9,31.4,27.5,24.6,22.3,20.5,19,17.8,16.7,15.9,15.1,14.4,13.9,13.3,12.9,12.5,null,22,158.30000000000001,80.900000000000006,55.1,42.2,34.5,29.4,25.7,23,20.8,19.100000000000001,17.8,16.600000000000001,15.6,14.8,14.1,13.5,13,12.5,12,11.7]
[23,172.9,88.4,60.2,46.1,37.700000000000003,32.1,28.1,25.1,22.8,20.9,19.399999999999999,18.2,17.100000000000001,16.2,15.4,14.7,14.2,13.6,13.2,12.7,null,23,161.6,82.6,56.3,43.1,35.200000000000003,30,26.2,23.4,21.3,19.5,18.100000000000001,17,16,15.1,14.4,13.8,13.2,12.7,12.3,11.9]
[24,176.5,90.2,61.5,47.1,38.5,32.799999999999997,28.7,25.6,23.2,21.4,19.8,18.5,17.5,16.5,15.7,15.1,14.5,13.9,13.4,13,null,24,165,84.3,57.4,44,36,30.6,26.8,23.9,21.7,20,18.5,17.3,16.3,15.5,14.7,14.1,13.5,13,12.6,12.2]
[25,180.2,92.1,62.7,48.1,39.299999999999997,33.4,29.3,26.2,23.7,21.8,20.2,18.899999999999999,17.8,16.899999999999999,16.100000000000001,15.4,14.8,14.2,13.7,13.3,null,25,168.4,86.1,58.6,44.9,36.700000000000003,31.3,27.4,24.4,22.2,20.399999999999999,18.899999999999999,17.7,16.7,15.8,15,14.4,13.8,13.3,12.8,12.4]
[26,183.9,94,64,49.1,40.1,34.1,29.9,26.7,24.2,22.3,20.7,19.3,18.2,17.2,16.399999999999999,15.7,15.1,14.5,14,13.6,null,26,171.9,87.9,59.9,45.9,37.5,31.9,27.9,25,22.6,20.8,19.3,18.100000000000001,17,16.100000000000001,15.3,14.7,14.1,13.6,13.1,12.7]
[27,187.7,95.9,65.400000000000006,50.1,40.9,34.799999999999997,30.5,27.3,24.7,22.7,21.1,19.7,18.600000000000001,17.600000000000001,16.8,16,15.4,14.8,14.3,13.9,null,27,175.5,89.7,61.1,46.8,38.299999999999997,32.6,28.5,25.5,23.1,21.2,19.7,18.399999999999999,17.399999999999999,16.5,15.7,15,14.4,13.9,13.4,13]
[28,191.6,97.9,66.7,51.1,41.8,35.6,31.1,27.8,25.3,23.2,21.5,20.100000000000001,19,18,17.100000000000001,16.399999999999999,15.7,15.1,14.6,14.2,null,28,179.2,91.6,62.4,47.8,39.1,33.299999999999997,29.1,26,23.6,21.7,20.100000000000001,18.8,17.7,16.8,16,15.3,14.7,14.2,13.7,13.2]
[29,195.6,99.9,68.099999999999994,52.2,42.7,36.299999999999997,31.8,28.4,25.8,23.7,22,20.6,19.399999999999999,18.399999999999999,17.5,16.7,16.100000000000001,15.5,14.9,14.5,null,29,182.9,93.5,63.7,48.8,39.9,34,29.7,26.6,24.1,22.2,20.6,19.2,18.100000000000001,17.2,16.3,15.6,15,14.5,14,13.5]
[30,199.6,102,69.5,53.3,43.5,37.1,32.5,29,26.3,24.2,22.4,21,19.8,18.8,17.899999999999999,17.100000000000001,16.399999999999999,15.8,15.3,14.8,null,30,186.7,95.4,65,49.8,40.700000000000003,34.700000000000003,30.3,27.1,24.6,22.6,21,19.600000000000001,18.5,17.5,16.7,16,15.3,14.8,14.3,13.8]
[31,203.7,104.1,70.900000000000006,54.4,44.4,37.799999999999997,33.1,29.6,26.9,24.7,22.9,21.4,20.2,19.100000000000001,18.2,17.399999999999999,16.7,16.100000000000001,15.6,15.1,null,31,190.5,97.4,66.400000000000006,50.9,41.6,35.4,31,27.7,25.1,23.1,21.4,20.100000000000001,18.899999999999999,17.899999999999999,17.100000000000001,16.3,15.7,15.1,14.6,14.1]
[32,207.9,106.3,72.400000000000006,55.5,45.4,38.6,33.799999999999997,30.2,27.4,25.2,23.4,21.9,20.6,19.600000000000001,18.600000000000001,17.8,17.100000000000001,16.5,15.9,15.4,null,32,194.5,99.4,67.7,51.9,42.4,36.1,31.6,28.3,25.7,23.6,21.9,20.5,19.3,18.3,17.399999999999999,16.7,16,15.4,14.9,14.4]
[33,212.2,108.4,73.900000000000006,56.6,46.3,39.4,34.5,30.9,28,25.7,23.9,22.4,21.1,20,19,18.2,17.5,16.8,16.3,15.8,null,33,198.5,101.4,69.099999999999994,53,43.3,36.9,32.299999999999997,28.9,26.2,24.1,22.4,20.9,19.7,18.7,17.8,17,16.3,15.7,15.2,14.7]
[34,216.5,110.7,75.400000000000006,57.8,47.3,40.200000000000003,35.200000000000003,31.5,28.6,26.3,24.4,22.8,21.5,20.399999999999999,19.399999999999999,18.600000000000001,17.8,17.2,16.600000000000001,16.100000000000001,null,34,202.5,103.5,70.599999999999994,54.1,44.2,37.6,33,29.5,26.7,24.6,22.8,21.4,20.100000000000001,19.100000000000001,18.2,17.399999999999999,16.7,16.100000000000001,15.5,15.1]
[35,220.9,112.9,76.900000000000006,59,48.2,41.1,36,32.1,29.2,26.8,24.9,23.3,22,20.8,19.8,19,18.2,17.600000000000001,17,16.5,null,35,206.7,105.7,72,55.2,45.1,38.4,33.6,30.1,27.3,25.1,23.3,21.8,20.6,19.5,18.600000000000001,17.8,17.100000000000001,16.399999999999999,15.9,15.4]
[36,225.3,115.2,78.5,60.2,49.2,41.9,36.700000000000003,32.799999999999997,29.8,27.4,25.4,23.8,22.4,21.3,20.3,19.399999999999999,18.600000000000001,17.899999999999999,17.3,16.8,null,36,210.9,107.8,73.5,56.3,46,39.200000000000003,34.299999999999997,30.7,27.9,25.6,23.8,22.3,21,19.899999999999999,19,18.100000000000001,17.399999999999999,16.8,16.2,15.7]
[37,229.9,117.5,80.099999999999994,61.4,50.2,42.8,37.4,33.5,30.4,27.9,25.9,24.3,22.9,21.7,20.7,19.8,19,18.3,17.7,17.2,null,37,215.2,110,75,57.5,47,40,35.1,31.3,28.5,26.2,24.3,22.7,21.4,20.3,19.399999999999999,18.5,17.8,17.2,16.600000000000001,16.100000000000001]
[38,234.5,119.9,81.7,62.6,51.2,43.6,38.200000000000003,34.200000000000003,31,28.5,26.5,24.8,23.4,22.2,21.1,20.2,19.399999999999999,18.7,18.100000000000001,17.600000000000001,null,38,219.6,112.2,76.5,58.7,48,40.799999999999997,35.799999999999997,32,29.1,26.7,24.8,23.2,21.9,20.8,19.8,18.899999999999999,18.2,17.5,17,16.5]
[39,239.2,122.3,83.4,63.9,52.3,44.5,39,34.9,31.7,29.1,27,25.3,23.9,22.6,21.6,20.7,19.899999999999999,19.2,18.5,18,null,39,224,114.5,78.099999999999994,59.9,49,41.7,36.5,32.700000000000003,29.7,27.3,25.3,23.7,22.4,21.2,20.2,19.399999999999999,18.600000000000001,17.899999999999999,17.399999999999999,16.8]
[40,244,124.8,85.1,65.2,53.3,45.4,39.799999999999997,35.6,32.299999999999997,29.7,27.6,25.9,24.4,23.1,22.1,21.1,20.3,19.600000000000001,19,18.399999999999999,null,40,228.6,116.9,79.7,61.1,50,42.6,37.299999999999997,33.299999999999997,30.3,27.9,25.9,24.2,22.8,21.7,20.7,19.8,19,18.3,17.8,17.2]
[41,248.9,127.3,86.8,66.599999999999994,54.4,46.4,40.6,36.299999999999997,33,30.4,28.2,26.4,24.9,23.6,22.5,21.6,20.8,20,19.399999999999999,18.8,null,41,233.2,119.3,81.3,62.4,51,43.4,38.1,34,30.9,28.4,26.4,24.7,23.3,22.1,21.1,20.2,19.5,18.8,18.2,17.600000000000001]
[42,253.9,129.80000000000001,88.5,67.900000000000006,55.5,47.3,41.5,37.1,33.700000000000003,31,28.8,27,25.5,24.2,23,22.1,21.2,20.5,19.899999999999999,19.3,null,42,237.9,121.7,83,63.6,52,44.3,38.9,34.799999999999997,31.6,29,27,25.3,23.9,22.6,21.6,20.7,19.899999999999999,19.2,18.600000000000001,18.100000000000001]
[43,258.89999999999998,132.4,90.3,69.3,56.7,48.3,42.3,37.9,34.4,31.6,29.4,27.6,26,24.7,23.6,22.6,21.7,21,20.3,19.7,null,43,242.7,124.1,84.6,64.900000000000006,53.1,45.3,39.700000000000003,35.5,32.200000000000003,29.7,27.6,25.8,24.4,23.1,22.1,21.2,20.399999999999999,19.7,19,18.5]
[44,264,135.1,92.1,70.7,57.8,49.3,43.2,38.6,35.1,32.299999999999997,30,28.2,26.6,25.2,24.1,23.1,22.2,21.5,20.8,20.2,null,44,247.5,126.6,86.4,66.2,54.2,46.2,40.5,36.200000000000003,32.9,30.3,28.2,26.4,24.9,23.7,22.6,21.7,20.8,20.100000000000001,19.5,19]
[45,269.2,137.69999999999999,93.9,72.099999999999994,59,50.3,44.1,39.4,35.9,33,30.7,28.8,27.2,25.8,24.6,23.6,22.8,22,21.3,20.7,null,45,252.5,129.19999999999999,88.1,67.599999999999994,55.3,47.1,41.3,37,33.6,31,28.8,27,25.5,24.2,23.1,22.2,21.4,20.6,20,19.399999999999999]
[46,274.5,140.5,95.8,73.5,60.2,51.3,45,40.299999999999997,36.6,33.700000000000003,31.4,29.4,27.8,26.4,25.2,24.2,23.3,22.5,21.9,null,null,46,257.60000000000002,131.80000000000001,89.9,69,56.4,48.1,42.2,37.799999999999997,34.4,31.6,29.4,27.6,26.1,24.8,23.7,22.7,21.9,21.1,20.5]
[47,279.89999999999998,143.19999999999999,97.7,75,61.4,52.4,45.9,41.1,37.4,34.5,32.1,30.1,28.4,27,25.8,24.8,23.9,23.1,null,null,null,47,262.7,134.4,91.7,70.400000000000006,57.6,49.1,43.1,38.6,35.1,32.4,30.1,28.3,26.7,25.4,24.3,23.3,22.4,21.7]
[48,285.39999999999998,146.1,99.7,76.5,62.7,53.5,46.9,42,38.299999999999997,35.299999999999997,32.799999999999997,30.8,29.1,27.7,26.5,25.4,24.5,null,null,null,null,48,268,137.1,93.6,71.8,58.8,50.2,44,39.5,35.9,33.1,30.8,28.9,27.3,26,24.9,23.9,23]
[49,291.10000000000002,149,101.7,78.099999999999994,64,54.6,47.9,43,39.1,36.1,33.6,31.6,29.9,28.4,27.2,26.1,null,null,null,null,null,49,273.39999999999998,139.9,95.5,73.400000000000006,60.1,51.3,45,40.4,36.799999999999997,33.9,31.6,29.6,28,26.7,25.5,24.5]
[50,296.89999999999998,152,103.8,79.8,65.400000000000006,55.8,49,44,40.1,36.9,34.4,32.299999999999997,30.6,29.1,27.9,null,null,null,null,null,null,50,279,142.9,97.6,75,61.4,52.5,46.1,41.3,37.6,34.700000000000003,32.299999999999997,30.4,28.8,27.4,26.2]
[51,302.8,155.19999999999999,106,81.5,66.8,57.1,50.2,45,41,37.799999999999997,35.299999999999997,33.200000000000003,31.4,29.9,null,null,null,null,null,null,null,51,284.7,145.9,99.7,76.599999999999994,62.8,53.7,47.1,42.3,38.5,35.6,33.200000000000003,31.2,29.5,28.1]
[52,308.8,158.30000000000001,108.2,83.2,68.3,58.3,51.3,46,42,38.799999999999997,36.1,34,32.200000000000003,null,null,null,null,null,null,null,null,52,290.39999999999998,148.9,101.8,78.3,64.2,54.9,48.2,43.3,39.5,36.4,34,32,30.3]
[53,314.8,161.4,110.4,84.9,69.7,59.6,52.4,47.1,43,39.700000000000003,37,34.799999999999997,null,null,null,null,null,null,null,null,null,53,296.3,151.9,103.9,79.900000000000006,65.599999999999994,56.1,49.3,44.3,40.4,37.299999999999997,34.799999999999997,32.799999999999997]
[54,320.89999999999998,164.7,112.7,86.7,71.2,60.9,53.6,48.2,44,40.6,37.9,null,null,null,null,null,null,null,null,null,null,54,302.2,155,106.1,81.7,67.099999999999994,57.4,50.5,45.4,41.4,38.299999999999997,35.700000000000003]
[55,327.10000000000002,167.9,115,88.5,72.8,62.3,54.8,49.3,45,41.6,null,null,null,null,null,null,null,null,null,null,null,55,308.3,158.19999999999999,108.3,83.4,68.599999999999994,58.7,51.7,46.4,42.4,39.200000000000003]
[56,333.5,171.3,117.3,90.4,74.3,63.7,56.1,50.4,46.1,null,null,null,null,null,null,null,null,null,null,null,null,56,314.5,161.5,110.6,85.3,70.099999999999994,60,52.9,47.6,43.4]
[57,340,174.8,119.8,92.3,76,65.099999999999994,57.4,51.6,null,null,null,null,null,null,null,null,null,null,null,null,null,57,320.89999999999998,164.9,113,87.1,71.7,61.4,54.1,48.7]
[58,346.8,178.3,122.3,94.3,77.599999999999994,66.599999999999994,58.7,null,null,null,null,null,null,null,null,null,null,null,null,null,null,58,327.60000000000002,168.4,115.5,89.1,73.3,62.9,55.4]
[59,353.8,182,124.9,96.4,79.400000000000006,68.099999999999994,null,null,null,null,null,null,null,null,null,null,null,null,null,null,null,59,334.5,172.1,118.1,91.1,75,64.400000000000006]
[60,361.1,185.9,127.6,98.5,81.2,null,null,null,null,null,null,null,null,null,null,null,null,null,null,null,null,60,341.7,175.9,120.8,93.3,76.8]
[61,368.7,189.9,130.4,100.8,null,null,null,null,null,null,null,null,null,null,null,null,null,null,null,null,null,61,349.3,179.9,123.6,95.5]
[62,376.7,194.2,133.4,null,null,null,null,null,null,null,null,null,null,null,null,null,null,null,null,null,null,62,357.3,184.1,126.5]
[63,385.2,198.6,null,null,null,null,null,null,null,null,null,null,null,null,null,null,null,null,null,null,null,63,365.8,188.6]
[64,394.3,null,null,null,null,null,null,null,null,null,null,null,null,null,null,null,null,null,null,null,null,64,375]

{"sheet":"NRA67","index":7,"n_rows":56,"n_cols":43,"rows_kept":56,"cut":false,"hidden":true,"merged":[[4,1,4,20],[4,23,4,42]]}
[]
["Regular Contribution Elections",null,null,null,null,null,null,null,null,null,null,null,null,null,null,null,null,null,null,null,null,null,"Regular Contribution Elections"]
["Table D67: Personal and Dependant’s Benefits, NRA 67",null,null,null,null,null,null,null,null,null,null,null,null,null,null,null,null,null,null,null,null,null,"Table P67: Personal Benefits, NRA 67 "]
[]
["Age when notice of election given\nâ","Monthly contribution to purchase £250 of APB at date of election, £",null,null,null,null,null,null,null,null,null,null,null,null,null,null,null,null,null,null,null,null,"Age when notice of election given\nâ","Monthly contribution to purchase £250 of APB at date of election, £"]
["Payment period (in years) à",1,2,3,4,5,6,7,8,9,10,11,12,13,14,15,16,17,18,19,20,null,"Payment period (in years) à",1,2,3,4,5,6,7,8,9,10,11,12,13,14,15,16,17,18,19,20]
[16,143.5,73.3,50,38.299999999999997,31.3,26.6,23.3,20.8,18.899999999999999,17.3,16.100000000000001,15.1,14.2,13.4,12.8,12.2,11.7,11.3,10.9,10.6,null,16,134.1,68.5,46.7,35.799999999999997,29.2,24.9,21.8,19.399999999999999,17.600000000000001,16.2,15,14.1,13.2,12.5,11.9,11.4,11,10.6,10.199999999999999,9.9]
[17,146.69999999999999,75,51.1,39.1,32,27.2,23.8,21.3,19.3,17.7,16.5,15.4,14.5,13.7,13.1,12.5,12,11.5,11.1,10.8,null,17,137,70,47.7,36.5,29.9,25.4,22.2,19.899999999999999,18,16.600000000000001,15.4,14.4,13.5,12.8,12.2,11.7,11.2,10.8,10.4,10.1]
[18,150.1,76.7,52.3,40,32.700000000000003,27.8,24.4,21.8,19.8,18.2,16.8,15.8,14.8,14.1,13.4,12.8,12.3,11.8,11.4,11,null,18,139.9,71.5,48.7,37.299999999999997,30.5,26,22.7,20.3,18.399999999999999,16.899999999999999,15.7,14.7,13.8,13.1,12.5,11.9,11.4,11,10.6,10.3]
[19,153.5,78.400000000000006,53.4,40.9,33.5,28.5,24.9,22.3,20.2,18.600000000000001,17.2,16.100000000000001,15.2,14.4,13.7,13.1,12.6,12.1,11.7,11.3,null,19,142.9,73,49.7,38.1,31.1,26.5,23.2,20.7,18.8,17.3,16,15,14.1,13.4,12.7,12.2,11.7,11.2,10.9,10.5]
[20,156.69999999999999,80.099999999999994,54.5,41.8,34.200000000000003,29.1,25.4,22.7,20.6,19,17.600000000000001,16.399999999999999,15.5,14.7,14,13.4,12.8,12.3,11.9,11.5,null,20,145.9,74.5,50.8,38.9,31.8,27.1,23.7,21.2,19.2,17.600000000000001,16.399999999999999,15.3,14.4,13.7,13,12.4,11.9,11.5,11.1,10.7]
[21,160,81.7,55.7,42.7,34.9,29.7,26,23.2,21.1,19.3,17.899999999999999,16.8,15.8,15,14.3,13.6,13.1,12.6,12.2,11.8,null,21,148.9,76.099999999999994,51.8,39.700000000000003,32.5,27.6,24.2,21.6,19.600000000000001,18,16.7,15.6,14.7,13.9,13.3,12.7,12.2,11.7,11.3,11]
[22,163.30000000000001,83.4,56.8,43.5,35.6,30.3,26.5,23.7,21.5,19.7,18.3,17.100000000000001,16.100000000000001,15.3,14.6,13.9,13.4,12.9,12.4,12,null,22,152,77.7,52.9,40.6,33.1,28.2,24.7,22.1,20,18.399999999999999,17.100000000000001,16,15,14.2,13.6,13,12.4,12,11.6,11.2]
[23,166.6,85.2,58,44.5,36.299999999999997,30.9,27.1,24.2,21.9,20.2,18.7,17.5,16.5,15.6,14.9,14.2,13.6,13.1,12.7,12.3,null,23,155.19999999999999,79.3,54,41.4,33.799999999999997,28.8,25.2,22.5,20.399999999999999,18.8,17.399999999999999,16.3,15.3,14.5,13.8,13.2,12.7,12.2,11.8,11.4]
[24,170.1,86.9,59.2,45.4,37.1,31.6,27.6,24.7,22.4,20.6,19.100000000000001,17.899999999999999,16.8,15.9,15.2,14.5,13.9,13.4,13,12.5,null,24,158.4,81,55.2,42.3,34.5,29.4,25.7,23,20.9,19.2,17.8,16.600000000000001,15.7,14.8,14.1,13.5,13,12.5,12.1,11.7]
[25,173.6,88.7,60.4,46.3,37.799999999999997,32.200000000000003,28.2,25.2,22.9,21,19.5,18.2,17.2,16.3,15.5,14.8,14.2,13.7,13.2,12.8,null,25,161.69999999999999,82.6,56.3,43.1,35.299999999999997,30,26.3,23.5,21.3,19.600000000000001,18.2,17,16,15.2,14.4,13.8,13.2,12.8,12.3,11.9]
[26,177.2,90.5,61.7,47.3,38.6,32.9,28.8,25.7,23.3,21.4,19.899999999999999,18.600000000000001,17.5,16.600000000000001,15.8,15.1,14.5,14,13.5,13.1,null,26,165.1,84.4,57.5,44,36,30.6,26.8,24,21.7,20,18.5,17.3,16.3,15.5,14.7,14.1,13.5,13,12.6,12.2]
[27,180.8,92.4,62.9,48.2,39.4,33.6,29.4,26.2,23.8,21.9,20.3,19,17.899999999999999,17,16.100000000000001,15.4,14.8,14.3,13.8,13.4,null,27,168.5,86.1,58.7,44.9,36.700000000000003,31.3,27.4,24.5,22.2,20.399999999999999,18.899999999999999,17.7,16.7,15.8,15,14.4,13.8,13.3,12.9,12.4]
[28,184.5,94.3,64.2,49.2,40.200000000000003,34.299999999999997,30,26.8,24.3,22.3,20.7,19.399999999999999,18.3,17.3,16.5,15.8,15.1,14.6,14.1,13.6,null,28,172,87.9,59.9,45.9,37.5,31.9,27.9,25,22.7,20.8,19.3,18.100000000000001,17,16.100000000000001,15.4,14.7,14.1,13.6,13.1,12.7]
[29,188.3,96.2,65.599999999999994,50.2,41.1,35,30.6,27.4,24.8,22.8,21.2,19.8,18.7,17.7,16.8,16.100000000000001,15.5,14.9,14.4,13.9,null,29,175.5,89.7,61.1,46.8,38.299999999999997,32.6,28.5,25.5,23.1,21.3,19.7,18.5,17.399999999999999,16.5,15.7,15,14.4,13.9,13.4,13]
[30,192.2,98.2,66.900000000000006,51.3,41.9,35.700000000000003,31.2,27.9,25.3,23.3,21.6,20.2,19.100000000000001,18.100000000000001,17.2,16.399999999999999,15.8,15.2,14.7,14.2,null,30,179.1,91.6,62.4,47.8,39.1,33.299999999999997,29.1,26,23.6,21.7,20.100000000000001,18.899999999999999,17.8,16.8,16,15.3,14.7,14.2,13.7,13.3]
[31,196.1,100.2,68.3,52.3,42.8,36.4,31.9,28.5,25.9,23.8,22.1,20.6,19.5,18.399999999999999,17.600000000000001,16.8,16.100000000000001,15.5,15,14.5,null,31,182.8,93.4,63.7,48.8,39.9,34,29.7,26.6,24.1,22.2,20.6,19.2,18.100000000000001,17.2,16.399999999999999,15.7,15,14.5,14,13.6]
[32,200.1,102.3,69.7,53.4,43.7,37.200000000000003,32.6,29.1,26.4,24.3,22.5,21.1,19.899999999999999,18.8,17.899999999999999,17.100000000000001,16.5,15.9,15.3,14.9,null,32,186.6,95.4,65,49.8,40.700000000000003,34.700000000000003,30.3,27.1,24.6,22.6,21,19.7,18.5,17.5,16.7,16,15.4,14.8,14.3,13.8]
[33,204.2,104.4,71.099999999999994,54.5,44.6,37.9,33.200000000000003,29.7,27,24.8,23,21.5,20.3,19.2,18.3,17.5,16.8,16.2,15.7,15.2,null,33,190.4,97.3,66.3,50.8,41.5,35.4,31,27.7,25.1,23.1,21.4,20.100000000000001,18.899999999999999,17.899999999999999,17.100000000000001,16.3,15.7,15.1,14.6,14.1]
[34,208.3,106.5,72.599999999999994,55.6,45.5,38.700000000000003,33.9,30.3,27.5,25.3,23.5,22,20.7,19.600000000000001,18.7,17.899999999999999,17.2,16.5,16,15.5,null,34,194.3,99.3,67.7,51.9,42.4,36.1,31.6,28.3,25.7,23.6,21.9,20.5,19.3,18.3,17.399999999999999,16.7,16,15.4,14.9,14.5]
[35,212.5,108.6,74,56.7,46.4,39.5,34.6,30.9,28.1,25.8,24,22.4,21.1,20,19.100000000000001,18.3,17.5,16.899999999999999,16.3,15.8,null,35,198.2,101.3,69,52.9,43.3,36.799999999999997,32.299999999999997,28.8,26.2,24.1,22.3,20.9,19.7,18.7,17.8,17,16.399999999999999,15.8,15.2,14.8]
[36,216.7,110.8,75.5,57.9,47.3,40.299999999999997,35.299999999999997,31.5,28.6,26.3,24.4,22.9,21.6,20.399999999999999,19.5,18.600000000000001,17.899999999999999,17.3,16.7,16.2,null,36,202.2,103.4,70.400000000000006,54,44.1,37.6,32.9,29.4,26.7,24.6,22.8,21.3,20.100000000000001,19.100000000000001,18.2,17.399999999999999,16.7,16.100000000000001,15.6,15.1]
[37,221.1,113,77,59.1,48.3,41.1,36,32.200000000000003,29.2,26.9,25,23.4,22,20.9,19.899999999999999,19,18.3,17.600000000000001,17.100000000000001,16.5,null,37,206.3,105.4,71.900000000000006,55.1,45,38.4,33.6,30,27.3,25.1,23.3,21.8,20.5,19.5,18.600000000000001,17.8,17.100000000000001,16.5,15.9,15.4]
[38,225.5,115.3,78.599999999999994,60.2,49.3,42,36.700000000000003,32.9,29.8,27.4,25.5,23.8,22.5,21.3,20.3,19.399999999999999,18.7,18,17.399999999999999,16.899999999999999,null,38,210.4,107.6,73.3,56.2,46,39.1,34.299999999999997,30.7,27.8,25.6,23.8,22.3,21,19.899999999999999,19,18.100000000000001,17.399999999999999,16.8,16.3,15.8]
[39,230,117.6,80.099999999999994,61.5,50.3,42.8,37.5,33.5,30.5,28,26,24.3,23,21.8,20.7,19.899999999999999,19.100000000000001,18.399999999999999,17.8,17.3,null,39,214.6,109.7,74.8,57.4,46.9,40,35,31.3,28.4,26.1,24.3,22.7,21.4,20.3,19.399999999999999,18.5,17.8,17.2,16.600000000000001,16.100000000000001]
[40,234.5,119.9,81.8,62.7,51.3,43.7,38.299999999999997,34.200000000000003,31.1,28.6,26.5,24.9,23.4,22.2,21.2,20.3,19.5,18.8,18.2,17.7,null,40,219,112,76.3,58.5,47.9,40.799999999999997,35.700000000000003,31.9,29,26.7,24.8,23.2,21.9,20.8,19.8,19,18.2,17.600000000000001,17,16.5]
[41,239.2,122.3,83.4,64,52.3,44.6,39,34.9,31.7,29.2,27.1,25.4,23.9,22.7,21.7,20.7,20,19.3,18.600000000000001,18.100000000000001,null,41,223.4,114.2,77.900000000000006,59.7,48.8,41.6,36.5,32.6,29.6,27.2,25.3,23.7,22.4,21.2,20.2,19.399999999999999,18.600000000000001,18,17.399999999999999,16.899999999999999]
[42,243.9,124.7,85.1,65.2,53.4,45.5,39.799999999999997,35.6,32.4,29.8,27.7,25.9,24.5,23.2,22.1,21.2,20.399999999999999,19.7,19.100000000000001,18.5,null,42,227.8,116.5,79.400000000000006,60.9,49.8,42.5,37.200000000000003,33.299999999999997,30.2,27.8,25.8,24.2,22.8,21.7,20.7,19.8,19.100000000000001,18.399999999999999,17.8,17.3]
[43,248.7,127.2,86.7,66.5,54.4,46.4,40.6,36.4,33,30.4,28.2,26.5,25,23.7,22.6,21.7,20.9,20.2,19.5,19,null,43,232.3,118.8,81,62.2,50.9,43.3,38,34,30.9,28.4,26.4,24.7,23.3,22.2,21.1,20.3,19.5,18.8,18.2,17.7]
[44,253.5,129.69999999999999,88.4,67.900000000000006,55.5,47.3,41.5,37.1,33.700000000000003,31,28.8,27,25.5,24.2,23.1,22.2,21.4,20.6,20,19.399999999999999,null,44,236.9,121.2,82.7,63.4,51.9,44.2,38.700000000000003,34.700000000000003,31.5,29,27,25.3,23.9,22.7,21.6,20.7,20,19.3,18.7,18.100000000000001]
[45,258.5,132.19999999999999,90.2,69.2,56.6,48.3,42.3,37.9,34.4,31.7,29.5,27.6,26.1,24.8,23.7,22.7,21.9,21.1,20.5,19.899999999999999,null,45,241.6,123.6,84.3,64.7,52.9,45.1,39.5,35.4,32.200000000000003,29.6,27.5,25.8,24.4,23.2,22.1,21.2,20.399999999999999,19.7,19.100000000000001,18.600000000000001]
[46,263.5,134.80000000000001,92,70.599999999999994,57.7,49.2,43.2,38.6,35.1,32.4,30.1,28.2,26.7,25.4,24.2,23.2,22.4,21.6,21,20.399999999999999,null,46,246.4,126.1,86,66,54,46,40.4,36.1,32.9,30.3,28.2,26.4,24.9,23.7,22.6,21.7,20.9,20.2,19.600000000000001,19.100000000000001]
[47,268.60000000000002,137.4,93.8,72,58.9,50.2,44.1,39.5,35.9,33.1,30.8,28.9,27.3,25.9,24.8,23.8,22.9,22.2,21.5,null,null,47,251.3,128.6,87.7,67.3,55.1,47,41.2,36.9,33.6,30.9,28.8,27,25.5,24.3,23.2,22.3,21.5,20.7,20.100000000000001]
[48,273.8,140.1,95.6,73.400000000000006,60.1,51.3,45,40.299999999999997,36.700000000000003,33.799999999999997,31.5,29.6,27.9,26.6,25.4,24.4,23.5,22.7,null,null,null,48,256.2,131.1,89.5,68.7,56.3,48,42.1,37.700000000000003,34.299999999999997,31.6,29.5,27.7,26.1,24.9,23.8,22.8,22,21.3]
[49,279.10000000000002,142.9,97.5,74.900000000000006,61.4,52.4,46,41.2,37.5,34.6,32.200000000000003,30.3,28.6,27.2,26,25,24.1,null,null,null,null,49,261.3,133.80000000000001,91.3,70.099999999999994,57.5,49,43,38.6,35.1,32.4,30.2,28.3,26.8,25.5,24.4,23.4,22.6]
[50,284.60000000000002,145.80000000000001,99.5,76.5,62.7,53.5,47,42.2,38.4,35.4,33,31,29.3,27.9,26.7,25.7,null,null,null,null,null,50,266.60000000000002,136.5,93.2,71.599999999999994,58.7,50.1,44,39.5,36,33.200000000000003,30.9,29,27.5,26.2,25,24.1]
[51,290.2,148.69999999999999,101.6,78.099999999999994,64,54.7,48.1,43.1,39.299999999999997,36.299999999999997,33.799999999999997,31.8,30.1,28.6,27.4,null,null,null,null,null,null,51,271.89999999999998,139.30000000000001,95.2,73.2,60,51.3,45,40.4,36.799999999999997,34,31.7,29.8,28.2,26.8,25.7]
[52,295.8,151.6,103.6,79.7,65.400000000000006,55.9,49.1,44.1,40.200000000000003,37.1,34.6,32.6,30.8,29.4,null,null,null,null,null,null,null,52,277.3,142.19999999999999,97.2,74.7,61.3,52.4,46.1,41.3,37.700000000000003,34.799999999999997,32.5,30.5,28.9,27.5]
[53,301.5,154.6,105.7,81.3,66.8,57.1,50.2,45.1,41.1,38,35.5,33.4,31.6,null,null,null,null,null,null,null,null,53,282.8,145,99.2,76.3,62.6,53.5,47.1,42.3,38.6,35.6,33.299999999999997,31.3,29.6]
[54,307.10000000000002,157.6,107.8,83,68.2,58.3,51.3,46.1,42.1,38.9,36.299999999999997,34.200000000000003,null,null,null,null,null,null,null,null,null,54,288.3,147.9,101.2,77.900000000000006,64,54.7,48.2,43.3,39.5,36.5,34.1,32.1]
[55,312.89999999999998,160.6,110,84.7,69.599999999999994,59.6,52.4,47.1,43,39.799999999999997,37.200000000000003,null,null,null,null,null,null,null,null,null,null,55,293.89999999999998,150.9,103.3,79.599999999999994,65.400000000000006,55.9,49.3,44.3,40.4,37.4,34.9]
[56,318.8,163.80000000000001,112.2,86.4,71.099999999999994,60.9,53.6,48.2,44,40.700000000000003,null,null,null,null,null,null,null,null,null,null,null,56,299.7,153.9,105.4,81.2,66.8,57.2,50.4,45.3,41.4,38.299999999999997]
[57,324.89999999999998,167,114.4,88.2,72.599999999999994,62.2,54.8,49.3,45.1,null,null,null,null,null,null,null,null,null,null,null,null,57,305.60000000000002,157,107.6,83,68.3,58.5,51.5,46.4,42.4]
[58,331.1,170.2,116.7,90.1,74.099999999999994,63.5,56,50.4,null,null,null,null,null,null,null,null,null,null,null,null,null,58,311.7,160.30000000000001,109.9,84.8,69.8,59.8,52.7,47.5]
[59,337.5,173.6,119.1,92,75.7,64.900000000000006,57.3,null,null,null,null,null,null,null,null,null,null,null,null,null,null,59,318,163.6,112.3,86.7,71.400000000000006,61.2,54]
[60,344.2,177.2,121.6,93.9,77.400000000000006,66.400000000000006,null,null,null,null,null,null,null,null,null,null,null,null,null,null,null,60,324.60000000000002,167.1,114.7,88.6,73,62.6]
[61,351.2,180.9,124.2,96,79.099999999999994,null,null,null,null,null,null,null,null,null,null,null,null,null,null,null,null,61,331.6,170.8,117.3,90.6,74.7]
[62,358.5,184.7,127,98.1,null,null,null,null,null,null,null,null,null,null,null,null,null,null,null,null,null,62,338.9,174.7,120,92.8]
[63,366.2,188.8,129.80000000000001,null,null,null,null,null,null,null,null,null,null,null,null,null,null,null,null,null,null,63,346.7,178.8,122.9]
[64,374.5,193.2,null,null,null,null,null,null,null,null,null,null,null,null,null,null,null,null,null,null,null,64,355,183.2]
[65,383.4,null,null,null,null,null,null,null,null,null,null,null,null,null,null,null,null,null,null,null,null,65,364]

{"sheet":"NRA68","index":8,"n_rows":57,"n_cols":43,"rows_kept":57,"cut":false,"hidden":true,"merged":[[4,1,4,20],[4,23,4,42]]}
[]
["Regular Contribution Elections",null,null,null,null,null,null,null,null,null,null,null,null,null,null,null,null,null,null,null,null,null,"Regular Contribution Elections"]
["Table D68: Personal and Dependant’s Benefits, NRA 68",null,null,null,null,null,null,null,null,null,null,null,null,null,null,null,null,null,null,null,null,null,"Table P68: Personal Benefits, NRA 68 "]
[]
["Age when notice of election given\nâ","Monthly contribution to purchase £250 of APB at date of election, £",null,null,null,null,null,null,null,null,null,null,null,null,null,null,null,null,null,null,null,null,"Age when notice of election given\nâ","Monthly contribution to purchase £250 of APB at date of election, £"]
["Payment period (in years) à",1,2,3,4,5,6,7,8,9,10,11,12,13,14,15,16,17,18,19,20,null,"Payment period (in years) à",1,2,3,4,5,6,7,8,9,10,11,12,13,14,15,16,17,18,19,20]
[16,138.4,70.7,48.2,36.9,30.2,25.7,22.5,20.100000000000001,18.2,16.7,15.5,14.5,13.7,13,12.3,11.8,11.3,10.9,10.5,10.199999999999999,null,16,128.9,65.900000000000006,44.9,34.4,28.1,23.9,20.9,18.7,17,15.6,14.5,13.5,12.7,12.1,11.5,11,10.5,10.1,9.8000000000000007,9.5]
[17,141.5,72.3,49.2,37.700000000000003,30.8,26.2,23,20.5,18.600000000000001,17.100000000000001,15.9,14.8,14,13.2,12.6,12,11.6,11.1,10.8,10.4,null,17,131.69999999999999,67.3,45.8,35.1,28.7,24.4,21.4,19.100000000000001,17.3,15.9,14.8,13.8,13,12.3,11.7,11.2,10.8,10.4,10,9.6999999999999993]
[18,144.80000000000001,74,50.4,38.6,31.6,26.9,23.5,21,19.100000000000001,17.5,16.2,15.2,14.3,13.6,12.9,12.3,11.8,11.4,11,10.7,null,18,134.5,68.7,46.8,35.9,29.3,24.9,21.8,19.5,17.7,16.3,15.1,14.1,13.3,12.6,12,11.5,11,10.6,10.199999999999999,9.9]
[19,148,75.599999999999994,51.5,39.5,32.299999999999997,27.5,24,21.5,19.5,17.899999999999999,16.600000000000001,15.5,14.6,13.9,13.2,12.6,12.1,11.7,11.3,10.9,null,19,137.30000000000001,70.2,47.8,36.6,29.9,25.5,22.3,19.899999999999999,18.100000000000001,16.600000000000001,15.4,14.4,13.6,12.9,12.2,11.7,11.2,10.8,10.4,10.1]
[20,151.1,77.2,52.6,40.299999999999997,32.9,28,24.5,21.9,19.899999999999999,18.3,17,15.9,14.9,14.1,13.5,12.9,12.4,11.9,11.5,11.1,null,20,140.19999999999999,71.599999999999994,48.8,37.4,30.6,26,22.8,20.3,18.5,17,15.7,14.7,13.9,13.1,12.5,11.9,11.5,11,10.7,10.3]
[21,154.19999999999999,78.8,53.7,41.1,33.6,28.6,25,22.4,20.3,18.7,17.3,16.2,15.2,14.4,13.7,13.1,12.6,12.1,11.7,11.4,null,21,143.1,73.099999999999994,49.8,38.200000000000003,31.2,26.6,23.2,20.8,18.8,17.3,16.100000000000001,15,14.1,13.4,12.8,12.2,11.7,11.3,10.9,10.5]
[22,157.4,80.400000000000006,54.8,42,34.299999999999997,29.2,25.6,22.8,20.7,19,17.7,16.5,15.6,14.7,14,13.4,12.9,12.4,12,11.6,null,22,146.1,74.7,50.9,39,31.8,27.1,23.7,21.2,19.2,17.7,16.399999999999999,15.3,14.4,13.7,13,12.5,12,11.5,11.1,10.8]
[23,160.6,82.1,55.9,42.8,35,29.8,26.1,23.3,21.2,19.399999999999999,18,16.899999999999999,15.9,15,14.3,13.7,13.1,12.7,12.2,11.8,null,23,149.1,76.2,51.9,39.799999999999997,32.5,27.7,24.2,21.6,19.600000000000001,18,16.7,15.7,14.7,14,13.3,12.7,12.2,11.8,11.4,11]
[24,163.9,83.8,57.1,43.7,35.700000000000003,30.4,26.6,23.8,21.6,19.8,18.399999999999999,17.2,16.2,15.4,14.6,14,13.4,12.9,12.5,12.1,null,24,152.19999999999999,77.8,53,40.6,33.200000000000003,28.2,24.7,22.1,20,18.399999999999999,17.100000000000001,16,15.1,14.3,13.6,13,12.5,12,11.6,11.2]
[25,167.3,85.5,58.2,44.6,36.5,31,27.2,24.3,22,20.2,18.8,17.600000000000001,16.600000000000001,15.7,14.9,14.3,13.7,13.2,12.7,12.3,null,25,155.30000000000001,79.400000000000006,54.1,41.4,33.9,28.8,25.2,22.5,20.5,18.8,17.399999999999999,16.3,15.4,14.6,13.9,13.3,12.7,12.3,11.8,11.5]
[26,170.7,87.2,59.4,45.5,37.200000000000003,31.7,27.7,24.8,22.5,20.7,19.2,17.899999999999999,16.899999999999999,16,15.2,14.6,14,13.5,13,12.6,null,26,158.5,81,55.2,42.3,34.6,29.4,25.8,23,20.9,19.2,17.8,16.7,15.7,14.9,14.2,13.5,13,12.5,12.1,11.7]
[27,174.2,89,60.6,46.5,38,32.299999999999997,28.3,25.3,23,21.1,19.600000000000001,18.3,17.2,16.3,15.6,14.9,14.3,13.8,13.3,12.9,null,27,161.80000000000001,82.7,56.3,43.2,35.299999999999997,30,26.3,23.5,21.3,19.600000000000001,18.2,17,16,15.2,14.4,13.8,13.3,12.8,12.3,12]
[28,177.8,90.8,61.9,47.4,38.799999999999997,33,28.9,25.8,23.4,21.5,20,18.7,17.600000000000001,16.7,15.9,15.2,14.6,14,13.6,13.1,null,28,165.1,84.4,57.5,44,36,30.6,26.8,24,21.8,20,18.600000000000001,17.399999999999999,16.399999999999999,15.5,14.8,14.1,13.5,13,12.6,12.2]
[29,181.4,92.7,63.2,48.4,39.6,33.700000000000003,29.5,26.3,23.9,22,20.399999999999999,19.100000000000001,18,17,16.2,15.5,14.9,14.3,13.9,13.4,null,29,168.5,86.1,58.7,45,36.700000000000003,31.3,27.4,24.5,22.2,20.399999999999999,18.899999999999999,17.7,16.7,15.8,15.1,14.4,13.8,13.3,12.9,12.5]
[30,185.1,94.6,64.5,49.4,40.4,34.4,30.1,26.9,24.4,22.4,20.8,19.5,18.3,17.399999999999999,16.600000000000001,15.8,15.2,14.6,14.2,13.7,null,30,171.9,87.9,59.9,45.9,37.5,31.9,28,25,22.7,20.8,19.3,18.100000000000001,17,16.2,15.4,14.7,14.1,13.6,13.1,12.7]
[31,188.9,96.5,65.8,50.4,41.2,35.1,30.7,27.4,24.9,22.9,21.2,19.899999999999999,18.7,17.8,16.899999999999999,16.2,15.5,15,14.5,14,null,31,175.5,89.7,61.1,46.8,38.299999999999997,32.6,28.5,25.5,23.1,21.3,19.7,18.5,17.399999999999999,16.5,15.7,15,14.4,13.9,13.4,13]
[32,192.7,98.5,67.099999999999994,51.4,42,35.799999999999997,31.3,28,25.4,23.4,21.7,20.3,19.100000000000001,18.100000000000001,17.3,16.5,15.9,15.3,14.8,14.3,null,32,179,91.5,62.3,47.8,39.1,33.299999999999997,29.1,26,23.6,21.7,20.2,18.899999999999999,17.8,16.8,16,15.3,14.7,14.2,13.7,13.3]
[33,196.6,100.5,68.5,52.5,42.9,36.5,32,28.6,25.9,23.8,22.1,20.7,19.5,18.5,17.600000000000001,16.899999999999999,16.2,15.6,15.1,14.6,null,33,182.7,93.4,63.6,48.8,39.9,33.9,29.7,26.6,24.1,22.2,20.6,19.2,18.100000000000001,17.2,16.399999999999999,15.7,15,14.5,14,13.6]
[34,200.5,102.5,69.8,53.5,43.8,37.299999999999997,32.6,29.2,26.5,24.3,22.6,21.1,19.899999999999999,18.899999999999999,18,17.2,16.5,15.9,15.4,14.9,null,34,186.3,95.2,64.900000000000006,49.8,40.700000000000003,34.6,30.3,27.1,24.6,22.6,21,19.600000000000001,18.5,17.5,16.7,16,15.4,14.8,14.3,13.9]
[35,204.5,104.5,71.2,54.6,44.6,38,33.299999999999997,29.8,27,24.8,23.1,21.6,20.3,19.3,18.399999999999999,17.600000000000001,16.899999999999999,16.3,15.7,15.2,null,35,190.1,97.2,66.2,50.8,41.5,35.299999999999997,30.9,27.7,25.1,23.1,21.4,20.100000000000001,18.899999999999999,17.899999999999999,17.100000000000001,16.3,15.7,15.1,14.6,14.2]
[36,208.5,106.6,72.7,55.7,45.5,38.799999999999997,34,30.4,27.6,25.3,23.5,22,20.8,19.7,18.7,17.899999999999999,17.2,16.600000000000001,16.100000000000001,15.6,null,36,193.9,99.1,67.5,51.8,42.3,36.1,31.6,28.2,25.6,23.6,21.9,20.5,19.3,18.3,17.399999999999999,16.7,16,15.4,14.9,14.5]
[37,212.7,108.7,74.099999999999994,56.8,46.4,39.6,34.6,31,28.1,25.9,24,22.5,21.2,20.100000000000001,19.100000000000001,18.3,17.600000000000001,17,16.399999999999999,15.9,null,37,197.8,101.1,68.900000000000006,52.8,43.2,36.799999999999997,32.200000000000003,28.8,26.2,24,22.3,20.9,19.7,18.7,17.8,17,16.399999999999999,15.8,15.3,14.8]
[38,216.9,110.9,75.599999999999994,57.9,47.4,40.4,35.299999999999997,31.6,28.7,26.4,24.5,22.9,21.6,20.5,19.5,18.7,18,17.3,16.8,16.3,null,38,201.7,103.1,70.3,53.9,44.1,37.5,32.9,29.4,26.7,24.5,22.8,21.3,20.100000000000001,19.100000000000001,18.2,17.399999999999999,16.7,16.100000000000001,15.6,15.1]
[39,221.1,113.1,77.099999999999994,59.1,48.3,41.2,36.1,32.200000000000003,29.3,26.9,25,23.4,22.1,20.9,20,19.100000000000001,18.399999999999999,17.7,17.100000000000001,16.600000000000001,null,39,205.7,105.2,71.7,55,45,38.299999999999997,33.5,30,27.2,25,23.3,21.8,20.5,19.5,18.600000000000001,17.8,17.100000000000001,16.5,15.9,15.5]
[40,225.5,115.3,78.599999999999994,60.3,49.3,42,36.799999999999997,32.9,29.9,27.5,25.5,23.9,22.5,21.4,20.399999999999999,19.5,18.8,18.100000000000001,17.5,17,null,40,209.8,107.3,73.099999999999994,56.1,45.9,39.1,34.200000000000003,30.6,27.8,25.6,23.7,22.2,21,19.899999999999999,19,18.2,17.5,16.8,16.3,15.8]
[41,229.9,117.6,80.2,61.5,50.3,42.8,37.5,33.6,30.5,28,26.1,24.4,23,21.8,20.8,19.899999999999999,19.2,18.5,17.899999999999999,17.399999999999999,null,41,214,109.4,74.599999999999994,57.2,46.8,39.9,34.9,31.2,28.4,26.1,24.2,22.7,21.4,20.3,19.399999999999999,18.600000000000001,17.8,17.2,16.7,16.2]
[42,234.4,119.9,81.7,62.7,51.3,43.7,38.299999999999997,34.200000000000003,31.1,28.6,26.6,24.9,23.5,22.3,21.3,20.399999999999999,19.600000000000001,18.899999999999999,18.3,17.8,null,42,218.2,111.6,76.099999999999994,58.4,47.7,40.700000000000003,35.6,31.9,29,26.6,24.7,23.2,21.9,20.8,19.8,19,18.3,17.600000000000001,17.100000000000001,16.600000000000001]
[43,238.9,122.2,83.3,63.9,52.3,44.6,39.1,34.9,31.7,29.2,27.1,25.4,24,22.8,21.7,20.8,20.100000000000001,19.399999999999999,18.8,18.2,null,43,222.5,113.8,77.599999999999994,59.5,48.7,41.5,36.4,32.5,29.6,27.2,25.3,23.7,22.3,21.2,20.2,19.399999999999999,18.7,18,17.5,17]
[44,243.5,124.6,85,65.2,53.3,45.4,39.799999999999997,35.6,32.4,29.8,27.7,26,24.5,23.3,22.2,21.3,20.5,19.8,19.2,18.7,null,44,226.8,116,79.099999999999994,60.7,49.7,42.3,37.1,33.200000000000003,30.2,27.8,25.8,24.2,22.8,21.7,20.7,19.8,19.100000000000001,18.5,17.899999999999999,17.399999999999999]
[45,248.2,127,86.6,66.400000000000006,54.4,46.3,40.6,36.4,33.1,30.4,28.3,26.5,25.1,23.8,22.7,21.8,21,20.3,19.7,19.100000000000001,null,45,231.2,118.3,80.7,61.9,50.7,43.2,37.799999999999997,33.9,30.8,28.3,26.4,24.7,23.3,22.2,21.2,20.3,19.600000000000001,18.899999999999999,18.3,17.8]
[46,253,129.4,88.3,67.7,55.4,47.3,41.4,37.1,33.700000000000003,31.1,28.9,27.1,25.6,24.3,23.3,22.3,21.5,20.8,20.100000000000001,19.600000000000001,null,46,235.7,120.6,82.3,63.1,51.7,44,38.6,34.6,31.4,29,26.9,25.3,23.9,22.7,21.7,20.8,20,19.399999999999999,18.8,18.2]
[47,257.8,131.9,90,69.099999999999994,56.5,48.2,42.3,37.9,34.5,31.7,29.5,27.7,26.2,24.9,23.8,22.8,22,21.3,20.6,20.100000000000001,null,47,240.3,123,83.9,64.400000000000006,52.7,44.9,39.4,35.299999999999997,32.1,29.6,27.5,25.8,24.4,23.2,22.2,21.3,20.5,19.8,19.2,18.7]
[48,262.7,134.5,91.7,70.400000000000006,57.7,49.2,43.2,38.700000000000003,35.200000000000003,32.4,30.2,28.4,26.8,25.5,24.4,23.4,22.6,21.8,21.2,null,null,48,245,125.4,85.6,65.7,53.8,45.9,40.299999999999997,36.1,32.799999999999997,30.3,28.2,26.4,25,23.8,22.7,21.8,21,20.399999999999999,19.7]
[49,267.8,137.1,93.6,71.900000000000006,58.9,50.2,44.1,39.5,36,33.200000000000003,30.9,29,27.5,26.1,25,24,23.1,22.4,null,null,null,49,249.8,127.9,87.3,67,54.9,46.9,41.1,36.9,33.6,31,28.8,27.1,25.6,24.4,23.3,22.4,21.6,20.9]
[50,272.89999999999998,139.80000000000001,95.5,73.3,60.1,51.3,45.1,40.4,36.799999999999997,34,31.6,29.7,28.1,26.8,25.6,24.6,23.8,null,null,null,null,50,254.7,130.5,89.1,68.5,56.1,47.9,42.1,37.700000000000003,34.4,31.7,29.5,27.8,26.3,25,23.9,23,22.2]
[51,278.2,142.5,97.4,74.900000000000006,61.4,52.4,46.1,41.3,37.700000000000003,34.799999999999997,32.4,30.5,28.8,27.5,26.3,25.3,null,null,null,null,null,51,259.8,133.1,90.9,69.900000000000006,57.3,49,43,38.6,35.200000000000003,32.5,30.3,28.4,26.9,25.6,24.5,23.6]
[52,283.5,145.30000000000001,99.3,76.400000000000006,62.7,53.5,47.1,42.3,38.5,35.6,33.200000000000003,31.2,29.5,28.1,26.9,null,null,null,null,null,null,52,264.8,135.69999999999999,92.8,71.400000000000006,58.5,50,44,39.5,36,33.200000000000003,31,29.1,27.6,26.3,25.2]
[53,288.7,148.1,101.2,77.900000000000006,63.9,54.7,48.1,43.2,39.4,36.4,34,31.9,30.3,28.8,null,null,null,null,null,null,null,53,269.89999999999998,138.4,94.6,72.8,59.8,51.1,45,40.4,36.799999999999997,34,31.7,29.9,28.3,27]
[54,294,150.9,103.2,79.5,65.2,55.8,49.1,44.1,40.299999999999997,37.200000000000003,34.700000000000003,32.700000000000003,31,null,null,null,null,null,null,null,null,54,275,141.1,96.5,74.3,61,52.2,45.9,41.3,37.700000000000003,34.799999999999997,32.5,30.6,29]
[55,299.39999999999998,153.69999999999999,105.2,81,66.599999999999994,57,50.2,45.1,41.2,38.1,35.6,33.5,null,null,null,null,null,null,null,null,null,55,280.2,143.9,98.5,75.8,62.3,53.3,47,42.2,38.5,35.6,33.299999999999997,31.3]
[56,304.8,156.6,107.2,82.6,67.900000000000006,58.2,51.3,46.1,42.1,39,36.4,null,null,null,null,null,null,null,null,null,null,56,285.5,146.69999999999999,100.5,77.400000000000006,63.6,54.5,48,43.2,39.4,36.5,34.1]
[57,310.39999999999998,159.5,109.3,84.3,69.3,59.4,52.4,47.1,43.1,39.799999999999997,null,null,null,null,null,null,null,null,null,null,null,57,291,149.5,102.5,79,65,55.7,49.1,44.2,40.4,37.4]
[58,316.10000000000002,162.5,111.5,86,70.8,60.7,53.5,48.1,44,null,null,null,null,null,null,null,null,null,null,null,null,58,296.60000000000002,152.5,104.6,80.7,66.400000000000006,56.9,50.2,45.2,41.3]
[59,322,165.7,113.7,87.7,72.2,62,54.7,49.2,null,null,null,null,null,null,null,null,null,null,null,null,null,59,302.39999999999998,155.6,106.7,82.4,67.8,58.2,51.3,46.2]
[60,328.1,168.9,115.9,89.5,73.8,63.3,55.9,null,null,null,null,null,null,null,null,null,null,null,null,null,null,60,308.39999999999998,158.80000000000001,109,84.2,69.3,59.5,52.5]
[61,334.4,172.3,118.3,91.4,75.3,64.7,null,null,null,null,null,null,null,null,null,null,null,null,null,null,null,61,314.7,162.1,111.3,86,70.900000000000006,60.9]
[62,341.1,175.8,120.8,93.4,77,null,null,null,null,null,null,null,null,null,null,null,null,null,null,null,null,62,321.39999999999998,165.6,113.8,88,72.599999999999994]
[63,348.1,179.5,123.4,95.5,null,null,null,null,null,null,null,null,null,null,null,null,null,null,null,null,null,63,328.4,169.3,116.4,90.1]
[64,355.7,183.5,126.2,null,null,null,null,null,null,null,null,null,null,null,null,null,null,null,null,null,null,64,336,173.4,119.3]
[65,363.7,187.7,null,null,null,null,null,null,null,null,null,null,null,null,null,null,null,null,null,null,null,65,344.1,177.6]
[66,372.3,null,null,null,null,null,null,null,null,null,null,null,null,null,null,null,null,null,null,null,null,66,352.7]

{"sheet":"ERF","index":9,"n_rows":25,"n_cols":13,"rows_kept":25,"cut":false,"hidden":true,"merged":[[1,0,1,13],[2,0,2,13],[3,0,3,13],[4,0,4,13],[5,0,5,12]]}
[]
["TABLE ERF1_NHSSS_2015"]
["NHS SUPERANNUATION SCHEME SCOTLAND (2015): ACTUARIAL FACTORS"]
["BENEFITS PAYABLE TO THE MEMBER ON VOLUNTARY EARLY RETIREMENT (WITH ACTUARIAL REDUCTION)"]
["FACTORS APPLICABLE TO MAIN SCHEME PENSION AND ADDITIONAL PENSION"]
["PENSION FACTORS"]
["Time to NPA: Monthsà\nYears â",0,1,2,3,4,5,6,7,8,9,10,11]
[0,1,0.995,0.99099999999999999,0.98599999999999999,0.98199999999999998,0.97699999999999998,0.97299999999999998,0.96799999999999997,0.96399999999999997,0.95899999999999996,0.95499999999999996,0.95]
[1,0.94599999999999995,0.94199999999999995,0.93799999999999994,0.93300000000000005,0.92900000000000005,0.92500000000000004,0.92100000000000004,0.91700000000000004,0.91300000000000003,0.90900000000000003,0.90400000000000003,0.9]
[2,0.89600000000000002,0.89200000000000002,0.88900000000000001,0.88500000000000001,0.88100000000000001,0.877,0.873,0.86899999999999999,0.86599999999999999,0.86199999999999999,0.85799999999999998,0.85399999999999998]
[3,0.85,0.84699999999999998,0.84299999999999997,0.84,0.83599999999999997,0.83299999999999996,0.82899999999999996,0.82599999999999996,0.82199999999999995,0.81899999999999995,0.81499999999999995,0.81200000000000006]
[4,0.80800000000000005,0.80500000000000005,0.80200000000000005,0.79900000000000004,0.79500000000000004,0.79200000000000004,0.78900000000000003,0.78600000000000003,0.78200000000000003,0.77900000000000003,0.77600000000000002,0.77300000000000002]
[5,0.76900000000000002,0.76600000000000001,0.76300000000000001,0.76,0.75700000000000001,0.754,0.751,0.748,0.745,0.74199999999999999,0.73899999999999999,0.73599999999999999]
[6,0.73299999999999998,0.73,0.72799999999999998,0.72499999999999998,0.72199999999999998,0.71899999999999997,0.71599999999999997,0.71399999999999997,0.71099999999999997,0.70799999999999996,0.70499999999999996,0.70199999999999996]
[7,0.7,0.69699999999999995,0.69399999999999995,0.69199999999999995,0.68899999999999995,0.68700000000000006,0.68400000000000005,0.68100000000000005,0.67900000000000005,0.67600000000000005,0.67400000000000004,0.67100000000000004]
[8,0.66800000000000004,0.66600000000000004,0.66400000000000003,0.66100000000000003,0.65900000000000003,0.65600000000000003,0.65400000000000003,0.65100000000000002,0.64900000000000002,0.64700000000000002,0.64400000000000002,0.64200000000000002]
[9,0.63900000000000001,0.63700000000000001,0.63500000000000001,0.63300000000000001,0.63,0.628,0.626,0.623,0.621,0.61899999999999999,0.61699999999999999,0.61399999999999999]
[10,0.61199999999999999,0.61,0.60799999999999998,0.60599999999999998,0.60399999999999998,0.60099999999999998,0.59899999999999998,0.59699999999999998,0.59499999999999997,0.59299999999999997,0.59099999999999997,0.58899999999999997]
[11,0.58699999999999997,0.58499999999999996,0.58299999999999996,0.58099999999999996,0.57899999999999996,0.57699999999999996,0.57499999999999996,0.57299999999999995,0.57099999999999995,0.56899999999999995,0.56699999999999995,0.56499999999999995]
[12,0.56299999999999994,0.56100000000000005,0.55900000000000005,0.55700000000000005,0.55500000000000005,0.55300000000000005,0.55100000000000005,0.55000000000000004,0.54800000000000004,0.54600000000000004,0.54400000000000004,0.54200000000000004]
[13,0.54]
[]
["  Notes: ","(1) NPA should be substituted for RRA where appropriate"]
["             ","(2) AP should be pro-rated to take account of unpaid contributions at date of retirement. Any paid up AP entitlement should include PI to DOR"]
[null,"(3) The appropriate factor is based on the period between DOR and NPA (or RRA) in years and months, rounded up to the next higher month.  "]

{"sheet":"Printable estimate","index":10,"n_rows":28,"n_cols":5,"rows_kept":28,"cut":false,"hidden":true,"merged":[[27,1,27,5],[2,1,2,5]]}
[]
[]
[null,"Illustration of additional pension benefit cost"]
[]
[null,"Your details"]
[null,"Date of Birth:",null,{"$f":"IF('Contributions calculator'!D4=\"\",\"\",'Contributions calculator'!D4)","v":""}]
[]
[null,"Normal pension age:",null,{"$f":"IF(Codes!F8>0,Codes!E8&\" years\",Codes!E8)","v":65},{"$f":"IF(AND(Codes!F8>0,Codes!F8<>\"\"),Codes!F8&\" months\",\"\")","v":""}]
[]
[null,"Date of election:",null,{"$f":"IF('Contributions calculator'!D9=\"\",\"\",'Contributions calculator'!D9)","v":""}]
[]
[null,"Age at start of agreement:",null,{"$f":"'Contributions calculator'!D11","v":""}]
[]
[]
[null,"Your input data"]
[]
[null,"Amount elected to purchase:",null,{"$f":"IF('Contributions calculator'!D17=\"\",\"\",'Contributions calculator'!D17)","v":6000}]
[]
[null,"Payment method:",null,{"$f":"IF('Contributions calculator'!D19=\"Regular contributions\",\"Regular contributions over \"&'Contributions calculator'!D21&\" years\",\"Lump sum\")","v":"Lump sum"}]
[]
[null,"Covered for family benefits?",null,{"$f":"IF('Contributions calculator'!D23=\"\",\"\",IF('Contributions calculator'!D23=Codes!D2,\"No\",IF('Contributions calculator'!D23=Codes!D3,\"Yes\")))","v":"No"}]
[]
[null,"Your estimated cost"]
[null,{"$f":"'Contributions calculator'!B27","v":"A lump sum payment of:-"},null,{"$f":"'Contributions calculator'!D27","v":""}]
[null,{"$f":"'Contributions calculator'!B28","v":""},null,{"$f":"'Contributions calculator'!D28","v":""}]
[null,{"$f":"'Contributions calculator'!B29","v":""},null,{"$f":"'Contributions calculator'!D29","v":""}]
[]
[null,"This calculation is intended for illustration purposes only. This is not a statement of you legal entitlement. While every care has been taken in the preperation of this calculator the Scottish Public Pension Agency will accept no responsibility for the accuracy of the ionformation it provides.\n\nPlease refer to pages on the SPPA website for points of contact and other benefits available."]

{"sheet":"Guidance notes","index":11,"n_rows":39,"n_cols":6,"rows_kept":39,"cut":false,"hidden":false,"merged":[]}
[]
[null,"Additional Pension guidance notes"]
[null,"Disclaimer:\nThis calculation is intended for illustration purposes only. This is not a statement of you legal entitlement. While every care has been taken in the preperation of this calculator the HSC Pension Service will accept no responsibility for the accuracy of the ionformation it provides.\n\nPlease refer to pages on the HSC Pension Service website for points of contact and other benefits available."]
[null,"Using the calculator\nYou must be a contributing member of one of the following schemes if you wish to purchase additional pension:\n• The Health and Personal Social Services (Northern Ireland) 1995/2008\n• The Health and Social Care Pension Scheme (Northern Ireland) 2015\n\nAP benefits will be paid with your scheme retirement benefits and will be index linked.\n\nThe cost of purchasing AP depends on your age and the amount of AP you wish to receive.\n\nThere are two ways you can pay for AP. You can pay by having regular deductions taken from your mionthly salary or by paying a one off lump sum.\n\nFor protected scheme members and members still covered by tapered protection the payable age for your election will be the same as your scheme pension age (60 or 65). All other members should use their state pension age to calculate the cost of additional pension.\n\nAdditional pension must be bought in multiples of £250. Therefore the minimum amount available to purchase is £250.\n\nThe maximum for each scheme is:\n\n• The Health and Personal Social Services (Northern Ireland) 1995/2008 £5000\n• The Health and Social Care Pension Scheme (Northern Ireland) 2015  £6500"]
[null,"HSC Pension Service\nWaterside House\n75 Duke Street, Londonderry\nBT47 6FP                 Telephone: 02871 319111"]
[]
[]
[]
[]
[]
[]
[]
[]
[]
[]
[]
[]
[]
[]
[]
[]
[]
[]
[]
[]
[]
[]
[]
[]
[]
[]
[]
[]
[]
[]
[]
[]
[]
[null,null,null,null,null,"G"]